{"text_format":"1","workbook":"xlsx","n_sheets":3,"sheets":["tek_doseme","dokuz_doseme","sematik_yerlesim"],"not_rendered":{"charts":0,"images":0,"macros":1,"external_links":0,"defined_names":2,"comments":0,"pivot_tables":0},"unopened":[],"bounds":{"document_bytes":16777216,"sheet_cells":100000,"rows_first":2000,"rows_last":500,"rows_between":2000,"halvings":0,"cell_chars":16384,"cell_head_chars":4096},"cells_cut":0,"cells_raw":0,"read":"whole","date_system":"1900"}

{"sheet":"tek_doseme","index":0,"n_rows":51,"n_cols":36,"rows_kept":51,"cut":false,"hidden":false,"merged":[[41,26,41,27],[42,13,42,14],[1,1,1,37],[27,25,29,25],[27,27,29,27],[40,25,41,25],[21,20,21,21],[42,15,42,16],[25,29,26,29],[27,29,29,29],[24,20,24,21],[14,25,15,25],[22,24,23,24],[25,24,26,24],[25,25,26,25],[25,27,26,27],[2,24,2,25],[2,26,2,27],[3,24,3,25],[3,26,3,27],[27,10,27,11],[21,22,21,23],[13,13,13,14],[13,15,13,16],[14,12,15,12],[5,9,5,10],[5,21,5,22],[9,12,9,13],[2,20,2,21],[2,22,2,23],[2,14,2,15],[8,23,9,23],[24,22,24,23],[14,26,14,27],[29,15,31,15],[32,15,33,15],[36,15,37,15],[25,18,25,19],[21,16,23,16],[18,15,19,15],[40,12,41,12],[35,12,37,12],[38,12,39,12],[24,5,24,6],[38,14,39,14],[22,2,23,2],[25,2,26,2],[25,7,25,8],[25,10,25,11],[25,14,25,15],[19,12,20,12],[21,3,21,4],[21,6,21,7],[21,15,23,15],[8,3,9,3],[16,6,16,7],[16,12,18,12],[16,14,17,14],[17,6,17,7],[3,10,3,11],[3,12,3,13],[3,14,3,15],[3,16,3,19],[3,20,3,21],[50,3,51,23],[12,25,13,25],[38,25,39,25],[2,4,2,5],[2,6,2,7],[2,8,2,9],[2,10,2,11],[2,12,2,13],[11,3,11,4],[11,12,11,13],[11,22,11,23],[7,12,7,13],[3,22,3,23],[3,4,3,5],[3,6,3,7],[3,8,3,9]]}
[]
[null,"TEK & ÇİFT DOĞRULTUDA ÇALIŞAN DÖŞEME DONATI UZUNLUKLARI HESABI\n(inş. Müh. Gürcan BERBEROĞLU tel: 0532 366 02 04  www.betoncelik.com) "]
[null,null,null,null,"Lsx",null,"Lsy",null,"Lsk",null,"Lx",null,"Ly",null,"Lk",null,null,null,null,null,"x",null,"y",null,"x",null,"y"]
[null,null,null,"D1",{"$f":"+M12","v":150},null,{"$f":"+Z28","v":450},null,{"$f":"MIN(E4,G4)","v":150},null,{"$f":"+M10","v":180},null,{"$f":"+AB28","v":477.5},null,{"$f":"MIN(K4,M4)","v":180},null,{"$f":"IF(MAX(K4,M4)/MIN(K4,M4)>2,\"tek doğrultu\",\"çift doğrultu\")","v":"tek doğrultu"},null,null,null,82,null,83,null,{"$f":"IF(Q4=\"tek doğrultu\",IF(K4=O4,0,1),0)","v":0},null,{"$f":"IF(Q4=\"tek doğrultu\",IF(M4=O4,0,1),0)","v":1}]
[null,null,null,null,null,null,null,null,null,null,null,null,null,null,null,null,null,null,null,null,null,"Dikkat sadece sarı hücrelere data giriniz."]
[null,null,null,null,null,null,"Pas payı =",null,null,2,null,"cm",null,null,"Kiriş içine saplama boyu =",null,null,null,null,null,null,35,null,"cm"]
[]
[null,null,null,null,null,null,null,null,null,null,null,null,{"$f":"+D12+M12+W12","v":210},null,"cm"]
[null,null,null,{"$f":"+D12/2","v":15},null,null,null,null,null,null,null,null,null,null,null,null,null,null,null,null,null,null,null,{"$f":"+W12","v":30}]
[null,null,null,null,null,null,null,null,null,null,null,null,{"$f":"+D12/2+M12+W12/2","v":180},null,"cm"]
[]
[null,null,null,30,null,"cm",null,null,null,null,null,null,150,null,"cm",null,null,null,null,null,null,null,30,null,"cm"]
[null,null,null,null,null,null,null,null,null,null,null,null,null,null,null,null,null,null,null,null,null,null,null,null,null,"cm"]
[null,null,null,null,null,null,null,null,null,null,null,null,null,{"$f":"+V6","v":35},null,{"$f":"IF(AA4=1,\"\",+V6)","v":""}]
[null,null,null,null,null,null,null,null,null,null,null,null,{"$f":"IF(AA4=1,Z28/4,Z28/5)+Z15-J6","v":135.5},null,null,null,null,null,null,null,null,null,null,null,null,25,{"$f":"+Z15/2","v":12.5},null,"cm"]
[]
[null,null,null,null,null,"hf=",10,null,"cm",null,null,null,{"$f":"+M15+N14","v":170.5},null,{"$f":"IF(AA4=1,\"\",+Z28/5+Z15-J6)","v":""}]
[null,null,null,null,null,null,10,null,"mm"]
[null,null,null,null,null,null,null,null,null,null,null,null,null,null,null,{"$f":"IF(AA4=1,\"\",+P37)","v":""}]
[null,null,null,null,null,null,null,null,null,null,null,null,"L ="]
[]
[null,null,null,{"$f":"IF(Y4=1,M12/4,M12/5)+D12-J6","v":58},null,"L=",{"$f":"+C23+D22","v":93},null,null,null,null,null,null,null,null,{"$f":"IF(AA4=1,\"\",Z28-Z28/5-Z28/5-2*SQRT(P19^2/2))","v":""},{"$f":"Z28+Z15+Z41-2*J6","v":501},null,null,"L=",{"$f":"+W22+Y23","v":93},null,{"$f":"IF(Y4=1,M12/4,M12/5)+W12-J6","v":58}]
[null,null,{"$f":"+V6","v":35},null,null,null,null,null,null,null,null,null,null,null,null,null,null,null,null,null,null,null,null,null,{"$f":"+V6","v":35}]
[null,null,null,null,null,null,null,null,null,null,null,null,null,null,null,null,null,null,null,null,null,null,null,null,null,null,null,null,null,null,null,null,null,null,null,"hf"]
[null,null,null,null,null,{"$f":"IF(Y4=1,\"\",M12/5+D12-J6)","v":58},null,null,null,null,null,null,null,null,null,null,null,null,null,null,{"$f":"IF(Y4=1,\"\",M12/5+W12-J6)","v":58}]
[null,null,{"$f":"IF(Y4=1,\"\",+V6)","v":35},null,null,null,null,{"$f":"IF(Y4=1,\"\",IF(M12<=Z28,SQRT(2*(G17-2*J6)^2),SQRT(2*(G17-G18/10-2*J6)^2)))","v":8.4852813742385695},null,null,{"$f":"IF(Y4=1,\"\",M12-M12/5-M12/5-2*SQRT(H26^2/2))","v":78},null,null,{"$f":"IF(Y4=1,\"\",\"L=\")","v":"L="},{"$f":"IF(Y4=1,\"\",+C26+F25+H26+K26+S26+U25+Y26)","v":280.97056274847716},null,null,null,{"$f":"IF(Y4=1,\"\",+H26)","v":8.4852813742385695},null,null,null,null,null,{"$f":"IF(Y4=1,\"\",V6)","v":35},"cm",null,"cm",null,"cm"]
[]
[null,null,null,null,null,null,null,null,null,null,{"$f":"+D12+M12+W12-2*J6","v":206},null,null,null,null,null,null,null,null,null,null,null,null,null,null,450,null,{"$f":"+Z15/2+Z28+Z41/2","v":477.5},null,{"$f":"+Z15+Z28+Z41","v":505}]
[]
[null,null,null,null,null,null,null,null,null,null,null,null,null,null,null,{"$f":"IF(AA4=1,\"\",+P14+O17+P19+P22+P37+O39+P43)","v":""}]
[]
[]
[null,null,null,null,null,null,null,null,null,null,null,null,null,null,null,{"$f":"IF(AA4=1,\"\",\"L =\")","v":""}]
[]
[]
[null,null,null,null,null,null,null,null,null,null,null,null,{"$f":"+M41+N43","v":175.5}]
[null,null,null,null,null,null,null,null,null,null,null,null,null,null,null,{"$f":"IF(AA4=1,\"\",IF(Z28<M12,SQRT(2*(G17-2*J6)^2),SQRT(2*(G17-G18/10-2*J6)^2)))","v":""}]
[]
[null,null,null,null,null,null,null,null,null,null,null,null,"L =",null,{"$f":"IF(AA4=1,\"\",+Z28/5+Z41)","v":""},null,null,null,null,null,null,null,null,null,null,"cm"]
[]
[null,null,null,null,null,null,null,null,null,null,null,null,{"$f":"IF(AA4=1,Z28/4,Z28/5)+Z41-J6","v":140.5},null,null,null,null,null,null,null,null,null,null,null,null,30]
[null,null,null,null,null,null,null,null,null,null,null,null,null,null,null,null,null,null,null,null,null,null,null,null,null,null,{"$f":"+Z41/2","v":15},null,"cm"]
[null,null,null,null,null,null,null,null,null,null,null,null,null,{"$f":"+V6","v":35},null,{"$f":"IF(AA4=1,\"\",+V6)","v":""}]
[]
[null,null,null,null,null,null,null,null,null,null,null,null,"hf"]
[]
[]
[]
[]
[]
[null,null,null,"Not: Bir döşemenin uzun kenarın kısa kenara bölümü 2 den büyükse döşeme tek doğrultuda çalışan döşemedir."]

{"sheet":"dokuz_doseme","index":1,"n_rows":104,"n_cols":74,"rows_kept":104,"cut":false,"hidden":false,"merged":[[15,3,16,3],[15,61,16,61],[21,64,21,65],[100,64,100,65],[2,24,2,25],[2,26,2,27],[2,20,2,21],[2,22,2,23],[11,12,11,13],[2,14,2,15],[3,14,3,15],[4,14,4,15],[5,14,5,15],[6,14,6,15],[7,14,7,15],[8,14,8,15],[9,14,9,15],[10,14,10,15],[11,14,11,15],[9,26,9,27],[10,24,10,25],[10,26,10,27],[11,24,11,25],[11,26,11,27],[4,24,4,25],[4,26,4,27],[3,24,3,25],[3,26,3,27],[2,10,2,11],[2,12,2,13],[3,10,3,11],[3,12,3,13],[4,10,4,11],[4,12,4,13],[11,10,11,11],[5,24,5,25],[5,26,5,27],[6,24,6,25],[6,26,6,27],[7,24,7,25],[7,26,7,27],[5,10,5,11],[5,12,5,13],[6,10,6,11],[6,12,6,13],[7,10,7,11],[7,12,7,13],[8,10,8,11],[8,12,8,13],[9,10,9,11],[9,12,9,13],[8,22,8,23],[9,20,9,21],[87,34,88,34],[54,32,56,32],[54,51,56,51],[14,31,14,32],[8,24,8,25],[8,26,8,27],[9,24,9,25],[9,22,9,23],[10,20,10,21],[10,22,10,23],[11,20,11,21],[11,22,11,23],[62,50,64,50],[65,50,66,50],[20,34,20,35],[29,22,29,23],[47,30,48,30],[47,49,48,49],[18,22,18,23],[18,31,18,32],[54,31,56,31],[54,50,56,50],[32,34,34,34],[35,34,36,34],[91,15,92,15],[24,6,24,7],[16,12,16,13],[20,13,20,14],[57,5,57,6],[83,5,83,6],[65,12,66,12],[58,10,58,11],[62,12,64,12],[54,12,56,12],[49,11,50,11],[54,13,56,13],[21,12,22,12],[88,15,90,15],[20,15,20,16],[58,15,58,16],[25,15,26,15],[18,12,18,13],[86,10,86,11],[21,63,22,63],[93,29,93,30],[80,16,82,16],[23,12,25,12],[26,12,27,12],[23,33,24,33],[39,29,39,30],[32,49,32,50],[58,49,58,50],[65,29,65,30],[91,29,91,30],[84,48,84,49],[23,14,24,14],[91,26,91,27],[91,37,91,38],[90,22,90,23],[90,41,90,42],[80,15,82,15],[65,34,65,35],[84,14,84,15],[91,33,91,34],[58,62,59,62],[28,58,28,59],[28,34,30,34],[99,63,100,63],[18,50,18,51],[18,60,18,61],[18,41,18,42],[84,63,85,63],[86,63,88,63],[81,62,82,62],[31,41,31,42],[73,63,74,63],[83,58,83,59],[97,52,98,52],[23,52,24,52],[28,53,30,53],[29,41,29,42],[84,52,84,53],[36,53,38,53],[39,53,40,53],[88,53,90,53],[91,53,92,53],[47,48,48,48],[49,44,49,45],[50,44,50,45],[34,49,34,50],[57,58,57,59],[60,67,62,67],[58,67,59,67],[32,63,33,63],[34,63,36,63],[58,63,59,63],[60,63,62,63],[32,65,33,65],[34,65,36,65],[58,65,59,65],[60,65,62,65],[47,63,48,63],[45,63,46,63],[29,2,30,2],[28,16,30,16],[36,15,38,15],[47,10,48,10],[43,15,44,15],[47,11,48,11],[32,2,33,2],[34,10,34,11],[32,10,32,11],[39,15,40,15],[28,6,28,7],[31,5,31,6],[32,7,32,8],[28,15,30,15],[55,62,56,62],[23,6,23,7],[32,14,32,15],[31,22,31,23],[32,18,32,19],[4,4,4,5],[4,6,4,7],[4,8,4,9],[5,4,5,5],[5,6,5,7],[5,8,5,9],[8,4,8,5],[8,6,8,7],[8,8,8,9],[9,4,9,5],[9,6,9,7],[9,8,9,9],[13,9,13,10],[13,21,13,22],[9,16,9,19],[10,16,10,19],[11,16,11,19],[10,10,10,11],[10,12,10,13],[84,65,85,65],[86,65,88,65],[2,4,2,5],[2,6,2,7],[2,8,2,9],[3,4,3,5],[3,6,3,7],[3,8,3,9],[23,25,23,26],[24,25,24,26],[23,44,23,45],[24,44,24,45],[49,6,49,7],[50,6,50,7],[49,25,49,26],[50,25,50,26],[28,3,28,4],[18,3,18,4],[10,4,10,5],[10,6,10,7],[10,8,10,9],[11,4,11,5],[11,6,11,7],[11,8,11,9],[28,60,28,61],[29,62,30,62],[20,53,20,54],[16,50,16,51],[16,31,16,32],[32,52,32,53],[39,33,39,34],[32,62,33,62],[32,56,32,57],[21,31,22,31],[23,31,25,31],[26,31,27,31],[20,32,20,33],[21,50,22,50],[23,50,25,50],[26,50,27,50],[20,51,20,52],[28,35,30,35],[28,54,30,54],[31,58,31,59],[101,53,101,54],[101,34,101,35],[101,15,101,16],[97,12,98,12],[94,12,96,12],[94,31,96,31],[97,31,98,31],[94,50,96,50],[97,50,98,50],[101,13,101,14],[101,32,101,33],[101,51,101,52],[99,12,100,12],[99,31,100,31],[99,50,100,50],[95,15,96,15],[95,34,96,34],[95,53,96,53],[97,33,98,33],[97,14,98,14],[84,62,85,62],[38,22,38,23],[38,41,38,42],[57,22,57,23],[57,41,57,42],[64,22,64,23],[64,41,64,42],[83,22,83,23],[83,41,83,42],[73,30,74,30],[43,53,44,53],[69,31,70,31],[51,31,52,31],[51,50,52,50],[54,58,54,59],[54,60,54,61],[80,58,80,59],[80,60,80,61],[81,22,81,23],[81,41,81,42],[55,22,55,23],[80,54,82,54],[80,34,82,34],[80,53,82,53],[58,2,59,2],[84,2,85,2],[73,14,74,14],[58,7,58,8],[58,18,58,19],[51,12,52,12],[69,12,70,12],[80,3,80,4],[80,6,80,7],[81,2,82,2],[73,10,74,10],[54,3,54,4],[55,2,56,2],[84,10,84,11],[75,6,75,7],[76,6,76,7],[54,6,54,7],[39,26,39,27],[39,37,39,38],[25,34,26,34],[43,34,44,34],[32,45,32,46],[25,53,26,53],[55,41,55,42],[73,29,74,29],[73,48,74,48],[58,53,58,54],[47,29,48,29],[41,29,41,30],[80,35,82,35],[75,25,75,26],[76,25,76,26],[75,44,75,45],[76,44,76,45],[73,49,74,49],[86,48,86,49],[59,31,61,31],[62,31,63,31],[84,34,86,34],[7,4,7,5],[7,6,7,7],[7,8,7,9],[84,7,84,8],[84,18,84,19],[84,45,84,46],[84,56,84,57],[47,14,48,14],[47,33,48,33],[47,52,48,52],[73,11,74,11],[73,33,74,33],[73,52,74,52],[69,50,70,50],[58,45,58,46],[58,56,58,57],[65,26,65,27],[65,37,65,38],[77,15,78,15],[77,34,78,34],[77,53,78,53],[60,10,60,11],[67,29,67,30],[60,49,60,50],[12,53,13,73],[71,63,72,63],[97,63,98,63],[1,1,1,75],[3,20,3,21],[3,22,3,23],[3,16,3,19],[4,16,4,19],[5,16,5,19],[6,16,6,19],[7,16,7,19],[8,16,8,19],[4,20,4,21],[4,22,4,23],[5,20,5,21],[5,22,5,23],[6,20,6,21],[6,22,6,23],[7,20,7,21],[7,22,7,23],[8,20,8,21],[6,4,6,5],[6,6,6,7],[6,8,6,9]]}
[]
[null,"KONUMUNA GÖRE TEK & ÇİFT DOĞRULTUDA ÇALIŞAN DÖŞEME DONATI UZUNLUKLARI HESABI\n(inş. Müh. Gürcan BERBEROĞLU tel: 0532 366 02 04  www.betoncelik.com) "]
[null,null,null,null,"Lsx",null,"Lsy",null,"Lsk",null,"Lx",null,"Ly",null,"Lk",null,null,null,null,null,"x",null,"y",null,"x",null,"y"]
[null,null,null,"D1",{"$f":"+M19","v":560},null,{"$f":"+BL35","v":480},null,{"$f":"MIN(E4,G4)","v":480},null,{"$f":"+M17","v":590},null,{"$f":"+BN35","v":507.5},null,{"$f":"MIN(K4,M4)","v":507.5},null,{"$f":"IF(MAX(K4,M4)/MIN(K4,M4)>2,\"tek doğrultu\",\"çift doğrultu\")","v":"çift doğrultu"},null,null,null,21,null,35,null,{"$f":"IF(Q4=\"tek doğrultu\",IF(K4=O4,0,1),0)","v":0},null,{"$f":"IF(Q4=\"tek doğrultu\",IF(M4=O4,0,1),0)","v":0}]
[null,null,null,"D2",{"$f":"+AF19","v":460},null,{"$f":"+BL35","v":480},null,{"$f":"MIN(E5,G5)","v":460},null,{"$f":"+AF17","v":490},null,{"$f":"+BN35","v":507.5},null,{"$f":"MIN(K5,M5)","v":490},null,"çift doğrultu",null,null,null,25,null,36,null,{"$f":"IF(Q5=\"tek doğrultu\",IF(K5=O5,0,1),0)","v":0},null,{"$f":"IF(Q5=\"tek doğrultu\",IF(M5=O5,0,1),0)","v":0}]
[null,null,null,"D3",{"$f":"+AY19","v":350},null,{"$f":"+BL35","v":480},null,350,null,{"$f":"+AY17","v":380},null,{"$f":"+BN35","v":507.5},null,380,null,"çift doğrultu",null,null,null,23,null,38,null,0,null,0]
[null,null,null,"D4",{"$f":"+M19","v":560},null,{"$f":"+BL61","v":365},null,365,null,{"$f":"+M17","v":590},null,{"$f":"+BN61","v":395},null,395,null,"çift doğrultu",null,null,null,26,null,42,null,0,null,0]
[null,null,null,"D5",{"$f":"+AF19","v":460},null,{"$f":"+BL61","v":365},null,365,null,{"$f":"+AF17","v":490},null,{"$f":"+BN61","v":395},null,395,null,"çift doğrultu",null,null,null,28,null,41,null,0,null,0]
[null,null,null,"D6",{"$f":"+AY19","v":350},null,{"$f":"+BL61","v":365},null,350,null,{"$f":"+AY17","v":380},null,{"$f":"+BN61","v":395},null,380,null,"çift doğrultu",null,null,null,30,null,39,null,0,null,0]
[null,null,null,"D7",{"$f":"+M19","v":560},null,{"$f":"+BL87","v":295},null,295,null,{"$f":"+M17","v":590},null,{"$f":"+BN87","v":322.5},null,322.5,null,"çift doğrultu",null,null,null,32,null,43,null,0,null,0]
[null,null,null,"D8",{"$f":"+AF19","v":460},null,{"$f":"+BL87","v":295},null,{"$f":"MIN(E11,G11)","v":295},null,{"$f":"+AF17","v":490},null,{"$f":"+BN87","v":322.5},null,322.5,null,"çift doğrultu",null,null,null,46,null,44,null,0,null,0]
[null,null,null,"D9",{"$f":"+AY19","v":350},null,{"$f":"+BL87","v":295},null,295,null,{"$f":"+AY17","v":380},null,{"$f":"+BN87","v":322.5},null,322.5,null,"çift doğrultu",null,null,null,34,null,45,null,0,null,0]
[null,null,null,null,null,null,null,null,null,null,null,null,null,null,null,null,null,null,null,null,null,null,null,null,null,null,null,null,null,null,null,null,null,null,null,null,null,null,null,null,null,"Dikkat sadece sarı hücrelere data giriniz.",null,null,null,null,null,null,null,null,null,null,null,"Not: Bir döşemenin uzun kenarın kısa kenara bölümü 2 den büyükse döşeme tek doğrultuda çalışan döşemedir."]
[null,null,null,null,null,null,"Pas payı =",null,null,2,null,"cm",null,null,"Kiriş içine saplama boyu =",null,null,null,null,null,null,35,null,"cm",null,null,"hf = döşeme kalınlığı",null,null,null,null,null,null,null,null,"her döşeme için kullanılacak demir çapı ayrı ayrı verilecektir."]
[null,null,null,null,null,null,null,null,null,null,null,null,null,null,null,null,null,null,null,null,null,null,null,null,null,null,null,null,null,null,null,{"$f":"+D19+M19+W19+AF19+AP19+AY19+BI19","v":1490},null,"cm"]
[null,null,null,{"$f":"+D19/2","v":15},null,null,null,null,null,null,null,null,null,null,null,null,null,null,null,null,null,null,null,null,null,null,null,null,null,null,null,null,null,null,null,null,null,null,null,null,null,null,null,null,null,null,null,null,null,null,null,null,null,null,null,null,null,null,null,null,null,{"$f":"+BI19/2","v":15}]
[null,null,null,null,null,null,null,null,null,null,null,null,{"$f":"+D19/2+M19+W19/2","v":590},null,"cm",null,null,null,null,null,null,null,null,null,null,null,null,null,null,null,null,{"$f":"+W19/2+AF19+AP19/2","v":490},null,"cm",null,null,null,null,null,null,null,null,null,null,null,null,null,null,null,null,{"$f":"+AP19/2+AY19+BI19/2","v":380},null,"cm"]
[]
[null,null,null,30,null,"cm",null,null,null,null,null,null,560,null,"cm",null,null,null,null,null,null,null,30,null,"cm",null,null,null,null,null,null,460,null,"cm",null,null,null,null,null,null,null,30,null,"cm",null,null,null,null,null,null,350,null,"cm",null,null,null,null,null,null,null,30,null,"cm"]
[]
[null,null,null,null,null,null,null,null,null,null,null,null,null,{"$f":"+V14","v":35},null,{"$f":"IF(AA4=1,\"\",+V14)","v":35},null,null,null,null,null,null,null,null,null,null,null,null,null,null,null,null,{"$f":"+V14","v":35},null,{"$f":"IF(AA5=1,\"\",+V14)","v":35},null,null,null,null,null,null,null,null,null,null,null,null,null,null,null,null,{"$f":"+V14","v":35},null,{"$f":"IF(AA6=1,\"\",+V14)","v":35}]
[null,null,null,null,null,null,null,null,null,null,null,null,{"$f":"IF(AA4=1,BL35/4,BL35/5)+BL22-J14","v":119},null,null,null,null,null,null,null,null,null,null,null,null,null,null,null,null,null,null,{"$f":"IF(AA5=1,BL35/4,BL35/5)+BL22-J14","v":119},null,null,null,null,null,null,null,null,null,null,null,null,null,null,null,null,null,null,{"$f":"IF(AA6=1,BL35/4,BL35/5)+BL22-J14","v":119},null,null,null,null,null,null,null,null,null,null,null,null,25,{"$f":"+BL22/2","v":12.5},null,"cm"]
[]
[null,null,null,null,null,"hf=",10,null,"cm",null,null,null,{"$f":"+M22+N21","v":154},null,{"$f":"IF(AA4=1,\"\",+BL35/5+BL22-J14)","v":119},null,null,null,null,null,null,null,null,null,"hf=",10,null,"cm",null,null,null,{"$f":"+AF22+AG21","v":154},null,{"$f":"IF(AA5=1,\"\",+BL35/5+BL22-J14)","v":119},null,null,null,null,null,null,null,null,null,"hf=",10,null,"cm",null,null,null,{"$f":"+AY22+AZ21","v":154},null,{"$f":"IF(AA6=1,\"\",BL35/5+BL22-J14)","v":119}]
[null,null,null,null,null,null,10,null,"mm",null,null,null,null,null,null,null,null,null,null,null,null,null,null,null,null,10,null,"mm",null,null,null,null,null,null,null,null,null,null,null,null,null,null,null,null,10,null,"mm"]
[null,null,null,null,null,null,null,null,null,null,null,null,null,null,null,{"$f":"IF(AA4=1,\"\",+P44)","v":8.4852813742385695},null,null,null,null,null,null,null,null,null,null,null,null,null,null,null,null,null,null,{"$f":"IF(AA5=1,\"\",+AI44)","v":7.0710678118654755},null,null,null,null,null,null,null,null,null,null,null,null,null,null,null,null,null,null,{"$f":"IF(AA6=1,\"\",+BB44)","v":7.0710678118654755}]
[null,null,null,null,null,null,null,null,null,null,null,null,"L =",null,null,null,null,null,null,null,null,null,null,null,null,null,null,null,null,null,null,"L =",null,null,null,null,null,null,null,null,null,null,null,null,null,null,null,null,null,null,"L ="]
[]
[null,null,null,{"$f":"IF(Y4=1,M19/4,M19/5)+D19-J14","v":140},null,"L=",{"$f":"+C30+D29","v":175},null,null,null,null,null,null,null,null,{"$f":"IF(AA4=1,\"\",BL35-BL35/5-BL35/5-2*SQRT(P26^2/2))","v":276},{"$f":"BL35+BL22+BL48-2*J14","v":531},null,null,null,null,null,null,null,null,null,null,null,null,null,null,null,null,null,{"$f":"IF(AA5=1,\"\",BL35-BL35/5-BL35/5-2*SQRT(AI26^2/2))","v":278},{"$f":"+BL35+BL22+BL48-2*J14","v":531},null,null,null,null,null,null,null,null,null,null,null,null,null,null,null,null,null,{"$f":"IF(AA6=1,\"\",BL35-BL35/5-BL35/5-2*SQRT(BB26^2/2))","v":278},{"$f":"+BL22+BL35+BL48-2*J14","v":531},null,null,"L=",{"$f":"+BI29+BK30","v":133},null,{"$f":"IF(Y6=1,AY19/4,AY19/5)+BI19-J14","v":98}]
[null,null,{"$f":"+V14","v":35},null,null,null,null,null,null,null,null,null,null,null,null,null,null,null,null,null,null,null,{"$f":"IF(Y4=1,M19/4,M19/5)+IF(Y5=1,AF19/4,AF19/5)+W19","v":234},null,null,null,null,null,null,null,null,null,null,null,null,null,null,null,null,null,null,{"$f":"IF(Y5=1,AF19/4,+AF19/5)+IF(Y6=1,AY19/4,AY19/5)+AP19","v":192},null,null,null,null,null,null,null,null,null,null,null,null,null,null,null,null,null,null,null,null,{"$f":"+V14","v":35}]
[null,null,null,null,null,null,null,null,null,null,null,null,null,null,null,null,null,null,null,null,null,null,null,null,null,null,null,null,null,null,null,null,null,null,null,null,null,null,null,null,null,null,null,null,null,null,null,null,null,null,null,null,null,null,null,null,null,null,null,null,null,null,null,null,null,null,null,null,null,null,null,null,null,"hf"]
[null,null,null,null,null,{"$f":"IF(Y4=1,\"\",M19/5+D19-J14)","v":140},null,null,null,null,null,null,null,null,null,null,null,null,null,null,null,null,{"$f":"IF(Y4=1,\"\",+M19/5+AF19/4+W19)","v":257},null,null,null,null,null,null,null,null,null,null,null,null,null,null,null,null,null,null,{"$f":"IF(Y6=1,\"\",+AY19/5+AF19/4+AP19)","v":215},null,null,null,null,null,null,null,null,null,null,null,null,null,null,null,null,{"$f":"IF(Y6=1,\"\",AY19/5+BI19-J14)","v":98}]
[null,null,{"$f":"IF(Y4=1,\"\",+V14)","v":35},null,null,null,null,{"$f":"IF(Y4=1,\"\",IF(M19<=BL35,SQRT(2*(G24-2*J14)^2),SQRT(2*(G24-G25/10-2*J14)^2)))","v":7.0710678118654755},null,null,{"$f":"IF(Y4=1,\"\",M19-M19/5-M19/5-2*SQRT(H33^2/2))","v":326},null,null,{"$f":"IF(Y4=1,\"\",\"L=\")","v":"L="},{"$f":"IF(Y4=1,\"\",+C33+F32+H33+K33+S33+W32)","v":772.14213562373095},null,null,null,{"$f":"IF(Y4=1,\"\",+H33)","v":7.0710678118654755},null,null,null,null,null,null,null,null,null,null,null,null,null,null,null,{"$f":"IF(AA5=1,\"\",+AI21+AH24+AI26+AI29+AI44+AH48)","v":663.39213562373095},null,null,null,null,null,null,null,null,null,null,{"$f":"IF(Y6=1,\"\",IF(AY19<=BL35,SQRT(2*(AS24-2*J14)^2),SQRT(2*(AS24-AS25/10-2*J14)^2)))","v":8.4852813742385695},null,null,null,{"$f":"IF(Y6=1,\"\",AY19-AY19/5-AY19/5-2*SQRT(AT33^2/2))","v":198},null,{"$f":"IF(Y6=1,\"\",\"L=\")","v":"L="},{"$f":"IF(Y6=1,\"\",+AP32+AT33+AX33+BE33+BG32+BK33)","v":562.97056274847716},null,null,null,{"$f":"IF(Y6=1,\"\",+AT33)","v":8.4852813742385695},null,null,null,null,null,{"$f":"IF(Y6=1,\"\",+V14)","v":35},"cm",null,"cm"]
[]
[null,null,null,null,null,null,null,null,null,null,{"$f":"+D19+M19+W19-2*J14","v":616},null,null,null,null,null,null,null,null,null,null,null,null,null,null,null,null,null,null,null,null,null,null,null,null,null,null,null,null,null,null,null,null,null,null,null,null,null,null,{"$f":"AP19+AY19+BI19-2*J14","v":406},null,null,null,null,null,null,null,null,null,null,null,null,null,480,null,{"$f":"+BL22/2+BL35+BL48/2","v":507.5}]
[null,null,null,null,null,null,null,null,null,null,null,null,null,null,null,null,null,null,null,null,null,null,null,null,null,null,null,null,null,null,null,null,null,null,{"$f":"IF(AA5=1,\"\",\"L =\")","v":"L ="}]
[null,null,null,null,null,null,null,null,null,null,null,null,null,null,null,{"$f":"IF(AA4=1,\"\",+P21+O24+P26+P29+P44+O48)","v":664.22056274847716},null,null,null,null,null,null,null,null,null,null,null,null,null,null,null,null,null,null,null,null,null,null,null,null,null,null,null,null,null,null,null,null,null,null,null,null,null,{"$f":"IF(AA6=1,\"\",+BB21+BA24+BB26+BB29+BB44+BA48)","v":663.39213562373095}]
[]
[null,null,null,null,null,null,null,null,null,null,null,null,null,null,null,null,null,null,null,null,null,null,{"$f":"IF(Y5=1,\"\",AF19/5+M19/4+W19)","v":262},null,null,null,null,null,null,null,null,null,null,null,null,null,null,null,null,null,null,{"$f":"IF(Y5=1,\"\",AF19/5+AY19/4+AP19)","v":209.5}]
[null,null,null,null,null,null,null,null,null,null,null,null,null,null,null,{"$f":"IF(AA4=1,\"\",\"L =\")","v":"L ="},null,null,null,null,null,null,null,null,null,null,{"$f":"IF(Y5=1,\"\",IF(AF19<=BL35,SQRT(2*(Z24-2*J14)^2),SQRT(2*(Z24-Z25/10-2*J14)^2)))","v":8.4852813742385695},null,null,{"$f":"IF(Y5=1,\"\",AF19-2*AF19/5-2*SQRT(AA40^2/2))","v":264},null,null,{"$f":"IF(Y5=1,\"\",\"L=\")","v":"L="},{"$f":"IF(Y5=1,\"\",+W39+AA40+AD40+AL40+AP39)","v":752.47056274847716},null,null,null,{"$f":"IF(Y5=1,\"\",+AA40)","v":8.4852813742385695},null,null,null,null,null,null,null,null,null,null,null,null,null,null,null,{"$f":"IF(AA6=1,\"\",\"L =\")","v":"L ="}]
[]
[null,null,null,null,null,null,null,null,null,null,null,null,null,null,null,null,null,null,null,null,null,null,null,null,null,null,null,null,null,{"$f":"+W19+AF19+AP19-2*J14","v":516}]
[]
[null,null,null,null,null,null,null,null,null,null,null,null,null,null,null,{"$f":"IF(AA4=1,\"\",IF(BL35<M19,SQRT(2*(G24-2*J14)^2),SQRT(2*(G24-G25/10-2*J14)^2)))","v":8.4852813742385695},null,null,null,null,null,null,null,null,null,null,null,null,null,null,null,null,null,null,{"$f":"IF(AA5=1,\"\",IF(BL35<AF19,SQRT(2*(Z24-2*J14)^2),SQRT(2*(Z24-Z25/10-2*J14)^2)))","v":7.0710678118654755},null,null,null,null,null,null,null,null,null,null,null,null,null,null,null,null,null,null,{"$f":"IF(AA6=1,\"\",IF(BL35<AY19,SQRT(2*(AS24-2*J14)^2),SQRT(2*(AS24-AS25/10-2*J14)^2)))","v":7.0710678118654755}]
[]
[null,null,null,null,null,null,null,null,null,null,null,null,null,null,null,null,null,null,null,null,null,null,null,null,null,null,null,null,null,null,null,null,null,null,null,null,null,null,null,null,null,null,null,null,null,null,null,null,null,null,null,null,null,null,null,null,null,null,null,null,null,null,null,"cm"]
[]
[null,null,null,null,null,null,null,null,null,null,{"$f":"IF(AA7=1,BL61/4,BL61/5)+IF(AA4=1,BL35/4,BL35/5)+BL48","v":199},{"$f":"IF(AA7=1,\"\",+BL61/5+BL35/4+BL48)","v":223},null,null,{"$f":"IF(AA4=1,\"\",+BL35/5+BL61/4+BL48)","v":217.25},null,null,null,null,null,null,null,null,null,null,null,null,null,null,{"$f":"IF(AA8=1,BL61/4,BL61/5)+IF(AA5=1,BL35/4,BL35/5)+BL48","v":199},{"$f":"IF(AA8=1,\"\",+BL61/5+BL35/4+BL48)","v":223},null,null,{"$f":"IF(AA5=1,\"\",BL35/5+BL61/4+BL48)","v":217.25},null,null,null,null,null,null,null,null,null,null,null,null,null,null,{"$f":"IF(AA6=1,BL35/4,BL35/5)+IF(AA9=1,BL61/4,BL61/5)+BL48","v":199},{"$f":"IF(AA9=1,\"\",BL61/5+BL35/4+BL48)","v":223},null,null,{"$f":"IF(AA6=1,\"\",+BL35/5+BL61/4+BL48)","v":217.25},null,null,null,null,null,null,null,null,null,null,30]
[]
[null,null,null,null,null,"hf=",10,null,"cm",null,null,null,null,null,null,null,null,null,null,null,null,null,null,null,"hf=",10,null,"cm",null,null,null,null,null,null,null,null,null,null,null,null,null,null,null,"hf=",10,null,"cm"]
[null,null,null,null,null,null,10,null,"mm",null,null,null,null,null,null,null,null,null,null,null,null,null,null,null,null,10,null,"mm",null,null,null,null,null,null,null,null,null,null,null,null,null,null,null,null,10,null,"mm"]
[null,null,null,null,null,null,null,null,null,null,null,null,{"$f":"IF(AA7=1,\"\",+M70)","v":8.4852813742385695},null,null,null,null,null,null,null,null,null,null,null,null,null,null,null,null,null,null,{"$f":"IF(AA8=1,\"\",+AF70)","v":8.4852813742385695},null,null,null,null,null,null,null,null,null,null,null,null,null,null,null,null,null,null,{"$f":"IF(AA9=1,\"\",+AY70)","v":7.0710678118654755}]
[]
[]
[null,null,null,{"$f":"IF(Y7=1,M19/4,M19/5)+D19-J14","v":140},null,"L=",{"$f":"+C56+D55","v":175},null,null,null,null,null,{"$f":"IF(AA7=1,\"\",+BL61-2*BL61/5-2*SQRT(M52^2/2))","v":207},{"$f":"+BL48+BL61+BL74-2*J14","v":421},null,null,null,null,null,null,null,null,null,null,null,null,null,null,null,null,null,{"$f":"IF(AA8=1,\"\",+BL61-2*BL61/5-2*SQRT(AF52^2/2))","v":207},{"$f":"+BL48+BL61+BL74-2*J14","v":421},null,null,null,null,null,null,null,null,null,null,null,null,null,null,null,null,null,{"$f":"IF(AA9=1,\"\",+BL61-2*BL61/5-2*SQRT(AY52^2/2))","v":209},{"$f":"+BL48+BL61+BL74-2*J14","v":421},null,null,null,null,null,"L=",{"$f":"+BI55+BK56","v":133},null,{"$f":"IF(Y9=1,AY19/4,AY19/5)+BI19-J14","v":98}]
[null,null,{"$f":"+V14","v":35},null,null,null,null,null,null,null,null,null,null,null,null,null,null,null,null,null,null,null,{"$f":"IF(Y7=1,M19/4,+M19/5)+IF(Y8=1,AF19/4,AF19/5)+W19","v":234},null,null,null,null,null,null,null,null,null,null,null,null,null,null,null,null,null,null,{"$f":"IF(Y8=1,AF19/4,AF19/5)+IF(Y9=1,AY19/4,AY19/5)+AP19","v":192},null,null,null,null,null,null,null,null,null,null,null,null,null,null,null,null,null,null,null,null,{"$f":"+V14","v":35}]
[]
[null,null,null,null,null,{"$f":"IF(Y7=1,\"\",+M19/5+D19-J14)","v":140},null,null,null,null,null,null,null,null,null,null,null,null,null,null,null,null,{"$f":"IF(Y7=1,\"\",+M19/5+AF19/4)","v":227},null,null,null,null,null,null,null,null,null,null,null,null,null,null,null,null,null,null,{"$f":"IF(Y9=1,\"\",+AY19/5+AF19/4)","v":185},null,null,null,null,null,null,null,null,null,null,null,null,null,null,null,null,{"$f":"IF(Y9=1,\"\",+AY19/5+BI19-J14)","v":98}]
[null,null,{"$f":"IF(Y7=1,\"\",+V14)","v":35},null,null,null,null,{"$f":"IF(Y7=1,\"\",IF(M19<=BL61,SQRT(2*(G50-2*J14)^2),SQRT(2*(G50-G51/10-2*J14)^2)))","v":7.0710678118654755},null,null,{"$f":"IF(Y7=1,\"\",M19-M19/5-M19/5-2*SQRT(H59^2/2))","v":326},null,null,null,{"$f":"IF(Y7=1,\"\",\"L=\")","v":"L="},{"$f":"IF(Y7=1,\"\",+C59+F58+H59+K59+S59+W58)","v":742.14213562373095},null,null,{"$f":"IF(Y7=1,\"\",+H59)","v":7.0710678118654755},null,null,null,null,null,null,null,null,null,null,null,null,null,null,null,null,null,null,null,null,null,null,null,null,null,null,{"$f":"IF(Y9=1,\"\",IF(AY19<=BL61,SQRT(2*(AS50-2*J14)^2),SQRT(2*(AS50-AS51/10-2*J14)^2)))","v":8.4852813742385695},null,null,null,{"$f":"IF(Y9=1,\"\",AY19-AY19/5-AY19/5-2*SQRT(AT59^2/2))","v":198},null,null,{"$f":"IF(Y9=1,\"\",\"L=\")","v":"L="},{"$f":"IF(Y9=1,\"\",+AP58+AT59+AX59+BE59+BG58+BK59)","v":532.97056274847716},null,null,{"$f":"IF(Y9=1,\"\",+AT59)","v":8.4852813742385695},null,null,null,null,null,{"$f":"IF(Y9=1,\"\",+V14)","v":35},"cm",null,"cm",null,"cm"]
[null,null,null,null,null,null,null,null,null,null,null,null,null,null,null,null,null,null,null,null,null,null,null,null,null,null,null,null,null,null,null,{"$f":"IF(AA8=1,\"\",+AE48+AF52+AF55+AF70+AE74)","v":623.72056274847716}]
[null,null,null,null,null,null,null,null,null,null,{"$f":"+D19+M19+W19-2*J14","v":616},null,null,null,null,null,null,null,null,null,null,null,null,null,null,null,null,null,null,null,null,null,null,null,null,null,null,null,null,null,null,null,null,null,null,null,null,null,null,{"$f":"AP19+AY19+BI19-2*J14","v":406},null,null,null,null,null,null,null,null,null,null,null,null,null,365,null,{"$f":"+BL48/2+BL61+BL74/2","v":395},null,{"$f":"+BL22+BL35+BL48+BL61+BL74+BL87+BL100","v":1250}]
[]
[null,null,null,null,null,null,null,null,null,null,null,null,{"$f":"IF(AA7=1,\"\",+L48+M52+M55+M70+L74)","v":623.72056274847716},null,null,null,null,null,null,null,null,null,null,null,null,null,null,null,null,null,null,{"$f":"IF(AA8=1,\"\",\"L =\")","v":"L ="},null,null,null,null,null,null,null,null,null,null,null,null,null,null,null,null,null,null,{"$f":"IF(AA9=1,\"\",+AX48+AY52+AY55+AY70+AX74)","v":622.89213562373095}]
[]
[null,null,null,null,null,null,null,null,null,null,null,null,null,null,null,null,null,null,null,null,null,null,{"$f":"IF(Y8=1,\"\",AF19/5+M19/4+W19)","v":262},null,null,null,null,null,null,null,null,null,null,null,null,null,null,null,null,null,null,{"$f":"IF(Y8=1,\"\",AF19/5+AY19/4+AP19)","v":209.5}]
[null,null,null,null,null,null,null,null,null,null,null,null,{"$f":"IF(AA7=1,\"\",\"L =\")","v":"L ="},null,null,null,null,null,null,null,null,null,null,null,null,null,{"$f":"IF(Y8=1,\"\",IF(AF19<=BL61,SQRT(2*(Z50-2*J14)^2),SQRT(2*(Z50-Z51/10-2*J14)^2)))","v":7.0710678118654755},null,null,{"$f":"IF(Y8=1,\"\",AF19-2*AF19/5-2*SQRT(AA66^2/2))","v":266},null,null,null,{"$f":"IF(Y8=1,\"\",\"L=\")","v":"L="},{"$f":"IF(Y8=1,\"\",+W65+AA66+AD66+AL66+AP65)","v":751.64213562373106},null,null,{"$f":"IF(Y8=1,\"\",+AA66)","v":7.0710678118654755},null,null,null,null,null,null,null,null,null,null,null,null,{"$f":"IF(AA9=1,\"\",\"L =\")","v":"L ="}]
[]
[null,null,null,null,null,null,null,null,null,null,null,null,null,null,null,null,null,null,null,null,null,null,null,null,null,null,null,null,null,{"$f":"+W19+AF19+AP19-2*J14","v":516}]
[]
[null,null,null,null,null,null,null,null,null,null,null,null,{"$f":"IF(AA7=1,\"\",IF(BL61<M19,SQRT(2*(G50-2*J14)^2),SQRT(2*(G50-G51/10-2*J14)^2)))","v":8.4852813742385695},null,null,null,null,null,null,null,null,null,null,null,null,null,null,null,null,null,null,{"$f":"IF(AA8=1,\"\",IF(BL61<AF19,SQRT(2*(Z50-2*J14)^2),SQRT(2*(Z50-Z51/10-2*J14)^2)))","v":8.4852813742385695},null,null,null,null,null,null,null,null,null,null,null,null,null,null,null,null,null,null,{"$f":"IF(AA9=1,\"\",IF(BL61<AY19,SQRT(2*(AS50-2*J14)^2),SQRT(2*(AS50-AS51/10-2*J14)^2)))","v":7.0710678118654755}]
[]
[null,null,null,null,null,null,null,null,null,null,null,null,null,null,null,null,null,null,null,null,null,null,null,null,null,null,null,null,null,null,null,null,null,null,null,null,null,null,null,null,null,null,null,null,null,null,null,null,null,null,null,null,null,null,null,null,null,null,null,null,null,null,null,"cm"]
[]
[null,null,null,null,null,null,null,null,null,null,{"$f":"IF(AA10=1,BL87/4,BL87/5)+IF(AA7=1,BL61/4,BL61/5)+BL74","v":162},{"$f":"IF(AA7=1,\"\",BL61/5+BL87/4+BL74)","v":176.75},null,null,{"$f":"IF(AA10=1,\"\",BL87/5+BL61/4+BL74)","v":180.25},null,null,null,null,null,null,null,null,null,null,null,null,null,null,{"$f":"IF(AA11=1,BL87/4,BL87/5)+IF(AA8=1,BL61/4,BL61/5)+BL74","v":162},{"$f":"IF(AA8=1,\"\",BL61/5+BL87/4+BL74)","v":176.75},null,null,{"$f":"IF(AA11=1,\"\",+BL87/5+BL61/4+BL74)","v":180.25},null,null,null,null,null,null,null,null,null,null,null,null,null,null,{"$f":"IF(AA12=1,BL87/4,BL87/5)+IF(AA9=1,BL61/4,BL61/5)+BL74","v":162},{"$f":"IF(AA9=1,\"\",BL61/5+BL87/4+BL74)","v":176.75},null,null,{"$f":"IF(AA12=1,\"\",BL87/5+BL61/4+BL74)","v":180.25},null,null,null,null,null,null,null,null,null,null,30]
[]
[null,null,null,null,null,"hf=",10,null,"cm",null,null,null,null,null,null,null,null,null,null,null,null,null,null,null,"hf=",10,null,"cm",null,null,null,null,null,null,null,null,null,null,null,null,null,null,null,"hf=",10,null,"cm"]
[null,null,null,null,null,null,10,null,"mm",null,null,null,null,null,null,null,null,null,null,null,null,null,null,null,null,10,null,"mm",null,null,null,null,null,null,null,null,null,null,null,null,null,null,null,null,10,null,"mm"]
[null,null,null,null,null,null,null,null,null,null,null,null,null,null,null,{"$f":"IF(AA10=1,\"\",+P96)","v":8.4852813742385695},null,null,null,null,null,null,null,null,null,null,null,null,null,null,null,null,null,null,{"$f":"IF(AA11=1,\"\",+AI96)","v":8.4852813742385695},null,null,null,null,null,null,null,null,null,null,null,null,null,null,null,null,null,null,{"$f":"IF(AA12=1,\"\",+BB96)","v":8.4852813742385695}]
[]
[]
[null,null,null,{"$f":"IF(Y10=1,M19/4,M19/5)+D19-J14","v":140},null,"L=",{"$f":"+C82+D81","v":175},null,null,null,null,null,null,null,null,{"$f":"IF(AA10=1,\"\",BL87-BL87/5-BL87/5-2*SQRT(P78^2/2))","v":165},{"$f":"+BL74+BL87+BL100-2*J14","v":346},null,null,null,null,null,null,null,null,null,null,null,null,null,null,null,null,null,{"$f":"IF(AA11=1,\"\",BL87-BL87/5-BL87/5-2*SQRT(AI78^2/2))","v":165},{"$f":"+BL74+BL87+BL100-2*J14","v":346},null,null,null,null,null,null,null,null,null,null,null,null,null,null,null,null,null,{"$f":"IF(AA12=1,\"\",BL87-BL87/5-BL87/5-2*SQRT(BB78^2/2))","v":165},{"$f":"+BL74+BL87+BL100-2*J14","v":346},null,null,"L=",{"$f":"+BI81+BK82","v":133},null,{"$f":"IF(Y12=1,AY19/4,AY19/5)+BI19-J14","v":98}]
[null,null,{"$f":"+V14","v":35},null,null,null,null,null,null,null,null,null,null,null,null,null,null,null,null,null,null,null,{"$f":"IF(Y10=1,M19/4,M19/5)+IF(Y11=1,AF19/4,AF19/5)+W19","v":234},null,null,null,null,null,null,null,null,null,null,null,null,null,null,null,null,null,null,{"$f":"IF(Y11=1,AF19/4,AF19/5)+IF(Y12=1,AY19/4,AY19/5)+AP19","v":192},null,null,null,null,null,null,null,null,null,null,null,null,null,null,null,null,null,null,null,null,{"$f":"+V14","v":35}]
[]
[null,null,null,null,null,{"$f":"IF(Y10=1,\"\",+M19/5+D19-J14)","v":140},null,null,null,null,null,null,null,null,null,null,null,null,null,null,null,null,{"$f":"IF(Y10=1,\"\",+M19/5+AF19/4)","v":227},null,null,null,null,null,null,null,null,null,null,null,null,null,null,null,null,null,null,{"$f":"IF(Y12=1,\"\",+AY19/5+AF19/4)","v":185},null,null,null,null,null,null,null,null,null,null,null,null,null,null,null,null,{"$f":"IF(Y12=1,\"\",+AY19/5+BI19-J14)","v":98}]
[null,null,{"$f":"IF(Y10=1,\"\",+V14)","v":35},null,null,null,null,{"$f":"IF(Y10=1,\"\",IF(M19<=BL87,SQRT(2*(G76-2*J14)^2),SQRT(2*(G76-G77/10-2*J14)^2)))","v":7.0710678118654755},null,null,{"$f":"IF(Y10=1,\"\",M19-M19/5-M19/5-2*SQRT(H85^2/2))","v":326},null,null,{"$f":"IF(Y10=1,\"\",\"L=\")","v":"L="},{"$f":"IF(Y10=1,\"\",+C85+F84+H85+K85+S85+W84)","v":742.14213562373095},null,null,null,{"$f":"IF(Y10=1,\"\",+H85)","v":7.0710678118654755},null,null,null,null,null,null,null,null,null,null,null,null,null,null,null,{"$f":"IF(AA11=1,\"\",+AH74+AI78+AI81+AI96+AH98+AI102)","v":479.22056274847716},null,null,null,null,null,null,null,null,null,null,{"$f":"IF(Y12=1,\"\",IF(AY19<=BL87,SQRT(2*(AS76-2*J14)^2),SQRT(2*(AS76-AS77/10-2*J14)^2)))","v":7.0710678118654755},null,null,{"$f":"IF(Y12=1,\"\",AY19-AY19/5-AY19/5-2*SQRT(AT85^2/2))","v":200},null,null,{"$f":"IF(Y12=1,\"\",\"L=\")","v":"L="},{"$f":"IF(Y12=1,\"\",+AP84+AT85+AW85+BE85+BG84+BK85)","v":532.14213562373095},null,null,null,{"$f":"IF(Y12=1,\"\",+AT85)","v":7.0710678118654755},null,null,null,null,null,{"$f":"IF(Y12=1,\"\",+V14)","v":35},"cm",null,"cm"]
[]
[null,null,null,null,null,null,null,null,null,null,{"$f":"+D19+M19+W19-2*J14","v":616},null,null,null,null,null,null,null,null,null,null,null,null,null,null,null,null,null,null,null,null,null,null,null,null,null,null,null,null,null,null,null,null,null,null,null,null,null,{"$f":"+AP19+AY19+BI19-2*J14","v":406},null,null,null,null,null,null,null,null,null,null,null,null,null,null,295,null,{"$f":"+BL74/2+BL87+BL100/2","v":322.5}]
[null,null,null,null,null,null,null,null,null,null,null,null,null,null,null,null,null,null,null,null,null,null,null,null,null,null,null,null,null,null,null,null,null,null,{"$f":"IF(AA11=1,\"\",\"L =\")","v":"L ="}]
[null,null,null,null,null,null,null,null,null,null,null,null,null,null,null,{"$f":"IF(AA10=1,\"\",+O74+P78+P81+P96+O98+P102)","v":479.22056274847716},null,null,null,null,null,null,null,null,null,null,null,null,null,null,null,null,null,null,null,null,null,null,null,null,null,null,null,null,null,null,null,null,null,null,null,null,null,{"$f":"IF(AA12=1,\"\",+BA74+BB78+BB81+BB96+BA98+BB102)","v":479.22056274847716}]
[]
[null,null,null,null,null,null,null,null,null,null,null,null,null,null,null,null,null,null,null,null,null,null,{"$f":"IF(Y11=1,\"\",AF19/5+M19/4+W19)","v":262},null,null,null,null,null,null,null,null,null,null,null,null,null,null,null,null,null,null,{"$f":"IF(Y11=1,\"\",AF19/5+AY19/4+AP19)","v":209.5}]
[null,null,null,null,null,null,null,null,null,null,null,null,null,null,null,{"$f":"IF(AA10=1,\"\",\"L =\")","v":"L ="},null,null,null,null,null,null,null,null,null,null,{"$f":"IF(Y11=1,\"\",IF(AF19<=BL87,SQRT(2*(Z76-2*J14)^2),SQRT(2*(Z76-Z77/10-2*J14)^2)))","v":7.0710678118654755},null,null,{"$f":"IF(Y11=1,\"\",AF19-2*AF19/5-2*SQRT(AA92^2/2))","v":266},null,null,{"$f":"IF(Y11=1,\"\",\"L=\")","v":"L="},{"$f":"IF(Y11=1,\"\",+W91+AA92+AD92+AL92+AP91)","v":751.64213562373106},null,null,null,{"$f":"IF(Y11=1,\"\",+AA92)","v":7.0710678118654755},null,null,null,null,null,null,null,null,null,null,null,null,null,null,null,{"$f":"IF(AA12=1,\"\",\"L =\")","v":"L ="}]
[]
[null,null,null,null,null,null,null,null,null,null,null,null,null,null,null,null,null,null,null,null,null,null,null,null,null,null,null,null,null,{"$f":"+W19+AF19+AP19-2*J14","v":516}]
[null,null,null,null,null,null,null,null,null,null,null,null,{"$f":"+M100+N102","v":117},null,null,null,null,null,null,null,null,null,null,null,null,null,null,null,null,null,null,{"$f":"+AF100+AG102","v":117},null,null,null,null,null,null,null,null,null,null,null,null,null,null,null,null,null,null,{"$f":"+AY100+AZ102","v":117}]
[null,null,null,null,null,null,null,null,null,null,null,null,null,null,null,{"$f":"IF(AA10=1,\"\",IF(BL87<AF19,SQRT(2*(G76-2*J14)^2),SQRT(2*(G76-G77/10-2*J14)^2)))","v":8.4852813742385695},null,null,null,null,null,null,null,null,null,null,null,null,null,null,null,null,null,null,{"$f":"IF(AA11=1,\"\",IF(BL87<AF19,SQRT(2*(Z76-2*J14)^2),SQRT(2*(Z76-Z77/10-2*J14)^2)))","v":8.4852813742385695},null,null,null,null,null,null,null,null,null,null,null,null,null,null,null,null,null,null,{"$f":"IF(AA12=1,\"\",IF(BL87<AY19,SQRT(2*(AS76-2*J14)^2),SQRT(2*(AS76-AS77/10-2*J14)^2)))","v":8.4852813742385695}]
[]
[null,null,null,null,null,null,null,null,null,null,null,null,"L=",null,{"$f":"IF(AA10=1,\"\",+BL87/5+BL100-J14)","v":82},null,null,null,null,null,null,null,null,null,null,null,null,null,null,null,null,"L=",null,{"$f":"IF(AA11=1,\"\",+BL87/5+BL100-J14)","v":82},null,null,null,null,null,null,null,null,null,null,null,null,null,null,null,null,"L=",null,{"$f":"IF(AA12=1,\"\",+BL87/5+BL100-J14)","v":82},null,null,null,null,null,null,null,null,null,null,"cm"]
[]
[null,null,null,null,null,null,null,null,null,null,null,null,{"$f":"IF(AA10=1,BL87/4,BL87/5)+BL100-J14","v":82},null,null,null,null,null,null,null,null,null,null,null,null,null,null,null,null,null,null,{"$f":"IF(AA11=1,BL87/4,BL87/5)+BL100-J14","v":82},null,null,null,null,null,null,null,null,null,null,null,null,null,null,null,null,null,null,{"$f":"IF(AA12=1,BL87/4,BL87/5)+BL100-J14","v":82},null,null,null,null,null,null,null,null,null,null,null,null,25]
[null,null,null,null,null,null,null,null,null,null,null,null,null,null,null,null,null,null,null,null,null,null,null,null,null,null,null,null,null,null,null,null,null,null,null,null,null,null,null,null,null,null,null,null,null,null,null,null,null,null,null,null,null,null,null,null,null,null,null,null,null,null,null,null,{"$f":"+BL100/2","v":12.5},null,"cm"]
[null,null,null,null,null,null,null,null,null,null,null,null,null,{"$f":"+V14","v":35},null,{"$f":"IF(AA10=1,\"\",+V14)","v":35},null,null,null,null,null,null,null,null,null,null,null,null,null,null,null,null,{"$f":"+V14","v":35},null,{"$f":"IF(AA11=1,\"\",+V14)","v":35},null,null,null,null,null,null,null,null,null,null,null,null,null,null,null,null,{"$f":"+V14","v":35},null,{"$f":"IF(AA12=1,\"\",+V14)","v":35}]
[]
[null,null,null,null,null,null,null,null,null,null,null,null,null,null,null,null,null,null,null,null,null,null,null,null,null,null,null,null,null,"hf"]

{"sheet":"sematik_yerlesim","index":2,"n_rows":67,"n_cols":20,"rows_kept":67,"cut":false,"hidden":false,"merged":[[1,1,1,23],[3,2,4,22]]}
[]
[null,"TEK VE ÇİFT DOĞRULTUDA ÇALIŞAN DÖŞEME ŞEMATİK DEMİR YERLEŞİMİ\n(inş. Müh. Gürcan BERBEROĞLU tel: 0532 366 02 04  www.betoncelik.com) "]
[]
[null,null,"Not: Bir döşemenin uzun kenarın kısa kenara bölümü 2 den büyükse döşeme tek doğrultuda çalışan döşemedir."]
[]
[]
[null,null,null,null,null,"ÇİFT DOĞRULTUDA ÇALIŞAN DÖŞEME DONATI YERLEŞİMİ"]
[]
[null,null,null,null,null,null,null,null,null,"Lx1",null,null,null,null,null,null,null,null,null,"Lx2"]
[]
[]
[]
[]
[]
[]
[]
[]
[]
[null,null,"Ly1"]
[]
[]
[]
[]
[]
[]
[]
[]
[]
[]
[null,null,"Ly2"]
[]
[]
[]
[]
[null,null,null,null,null,"TEK DOĞRULTUDA ÇALIŞAN DÖŞEME DONATI YERLEŞİMİ"]
[]
[null,null,null,null,null,null,null,null,null,null,"Lx1",null,null,null,null,null,null,null,null,"Lx2"]
[]
[]
[]
[]
[]
[]
[]
[]
[]
[]
[]
[]
[]
[]
[null,null,"Ly1"]
[]
[]
[]
[]
[]
[]
[]
[]
[]
[]
[]
[]
[]
[]
[null,null,"Ly2"]