{"text_format":"1","workbook":"xlsx","n_sheets":5,"sheets":["1_aciklikli","2_aciklikli","3_aciklikli","4_aciklikli","5_aciklikli"],"not_rendered":{"charts":0,"images":1,"macros":1,"external_links":0,"defined_names":0,"comments":0,"pivot_tables":0},"unopened":[],"bounds":{"document_bytes":16777216,"sheet_cells":100000,"rows_first":2000,"rows_last":500,"rows_between":2000,"halvings":0,"cell_chars":16384,"cell_head_chars":4096},"cells_cut":0,"cells_raw":0,"read":"whole","date_system":"1900"}

{"sheet":"1_aciklikli","index":0,"n_rows":155,"n_cols":25,"rows_kept":155,"cut":false,"hidden":false,"merged":[[1,1,1,36],[2,13,2,14],[3,6,3,7],[3,16,3,17],[5,8,6,8],[5,18,6,18],[9,3,9,4],[11,6,13,6],[11,8,11,9],[11,16,13,16],[10,3,10,4],[12,8,12,9],[11,13,11,14],[9,18,9,19],[9,6,10,6],[9,8,9,9],[9,13,9,14],[9,16,10,16],[10,8,10,9],[10,13,10,14],[11,3,11,4],[13,8,13,9],[13,13,13,14],[11,18,11,19],[13,24,15,24],[12,3,12,4],[14,6,15,6],[14,8,14,9],[14,13,14,14],[14,16,15,16],[12,18,12,19],[13,3,13,4],[15,8,15,9],[15,13,15,14],[13,18,13,19],[14,3,14,4],[16,6,18,6],[16,8,16,9],[16,13,16,14],[16,16,18,16],[14,18,14,19],[18,2,18,3],[18,11,18,12],[18,19,18,20],[19,5,19,6],[19,7,19,8],[19,11,19,12],[19,15,19,16],[19,17,19,18],[16,3,16,4],[20,4,20,5],[20,6,22,6],[20,8,20,9],[20,14,20,15],[20,16,22,16],[20,18,20,19],[21,4,21,5],[21,8,21,9],[21,14,21,15],[21,18,21,19],[22,4,22,5],[22,8,22,9],[22,14,22,15],[22,18,22,19],[23,4,23,5],[23,6,24,6],[23,8,23,9],[23,14,23,15],[23,16,24,16],[23,18,23,19],[24,4,24,5],[24,8,24,9],[24,14,24,15],[24,18,24,19],[24,24,26,24],[25,4,25,5],[25,6,27,6],[25,8,25,9],[25,14,25,15],[25,16,27,16],[25,18,25,19],[26,4,26,5],[26,8,26,9],[26,14,26,15],[26,18,26,19],[27,4,27,5],[27,8,27,9],[27,14,27,15],[27,18,27,19],[28,4,28,5],[28,6,29,6],[28,8,28,9],[28,14,28,15],[28,16,29,16],[28,18,28,19],[29,4,29,5],[30,8,30,9],[30,14,30,15],[29,18,29,19],[37,6,37,7],[37,16,37,17],[42,11,42,12],[44,7,44,8],[45,14,47,14],[49,11,49,12],[35,3,35,4],[35,11,35,12],[35,18,35,19],[39,8,40,8],[39,18,40,18],[58,5,58,6],[58,17,58,18],[60,4,60,5],[60,8,60,9],[60,14,60,15],[60,18,60,19],[51,3,51,4],[51,9,51,10],[51,13,51,14],[51,19,51,20],[56,7,56,8],[57,15,57,16],[61,4,61,5],[61,8,61,9],[61,14,61,15],[61,18,61,19],[64,11,64,12],[73,3,73,4],[73,9,73,10],[73,13,73,14],[73,19,73,20],[85,19,85,20],[86,3,86,4],[86,9,86,10],[86,13,86,14],[86,19,86,20],[76,3,76,4],[76,9,76,10],[76,13,76,14],[76,19,76,20],[83,7,83,8],[83,17,83,18],[88,15,88,16],[89,5,89,6],[90,8,90,9],[98,3,98,4],[98,9,98,10],[98,13,98,14],[85,3,85,4],[85,9,85,10],[85,13,85,14],[151,10,153,13],[151,14,153,16],[98,19,98,20],[100,1,103,6],[100,7,103,16],[141,1,145,6],[141,7,145,9],[141,10,145,13],[141,14,145,16],[129,11,129,12],[133,11,133,12],[33,17,33,18],[33,20,33,21],[16,10,16,11],[29,8,29,9],[29,14,29,15],[12,13,12,14],[10,18,10,19],[16,19,16,20],[154,1,156,6],[154,7,156,9],[154,10,156,13],[154,14,156,16],[33,2,33,3],[33,5,33,6],[33,8,33,9],[33,13,33,14],[121,11,121,12],[125,11,125,12],[146,1,150,6],[146,7,150,9],[146,10,150,13],[146,14,150,16],[151,1,153,6],[151,7,153,9]]}
[]
[null,"SAPLAMA KİRİŞLİ ÇERÇEVE CROSS (1 AÇIKLIKLI)\n(inş.müh. Gürcan BERBEROĞLU tel: 0532 366 02 04   www.betoncelik.com )"]
[null,null,null,null,null,null,null,null,"pas payı  d ' =",null,null,null,null,0.03,null,"m",null,null,null,null,"dikkat sadece sarı hücrelere rakam giriniz."]
[null,null,null,null,null,null,0.5,null,"m",null,null,null,null,null,null,null,0.5,null,"m"]
[null,null,null,null,null,null,null,null,"m",null,null,null,null,null,null,null,null,null,"m"]
[null,null,null,null,null,null,null,null,0.6,null,null,null,null,null,null,null,null,null,0.6]
[]
[]
[]
[null,null,null,{"$f":"SUM(D11:E15)","v":-9.0386632516933823},null,null,"dm4",null,null,null,null,null,null,null,null,null,"dm4",null,{"$f":"SUM(S11:T15)","v":7.9710999787298285}]
[null,null,null,{"$f":"-I29*G21","v":-1.1308920117015406E-4}]
[null,null,null,{"$f":"-I27*G21","v":-2.7773996079790177E-3},null,null,{"$f":"I6*G4^3/12*10000","v":62.499999999999993},null,{"$f":"SUM(I13:J17)","v":-8.3250845739281178},null,null,null,null,{"$f":"SUM(N13:O17)","v":8.654337119763813},null,null,{"$f":"S6*Q4^3/12*10000","v":62.499999999999993},null,{"$f":"-(O28)*Q17","v":5.1619548411350623E-4}]
[null,null,null,{"$f":"-I25*G21","v":-6.8211186413772523E-2},null,null,null,null,{"$f":"-I29*G17","v":-1.0416110634093139E-4},null,null,null,null,null,null,null,null,null,{"$f":"-(O26)*Q17","v":1.2677436221874751E-2},null,null,null,null,null,"m"]
[null,null,null,{"$f":"-I23*G21","v":-1.675223809569133},null,null,null,null,{"$f":"-I27*G17","v":-2.5581312178754117E-3},null,null,null,null,{"$f":"-(O28)*Q21","v":5.6044081132323531E-4},null,null,null,null,{"$f":"-(O24)*Q17","v":0.31134985505677498},null,null,null,null,null,3.8]
[null,null,null,{"$f":"-(E21+I21)*G21","v":-7.2923377669013272},null,null,"I =",null,{"$f":"-I25*G17","v":-6.2826092749527343E-2},null,null,null,null,{"$f":"-(O26)*Q21","v":1.3764073612321156E-2},null,null,"I =",null,{"$f":"-(O21+O22+S21)*Q17","v":7.6465564919670648}]
[null,null,null,null,null,null,null,null,{"$f":"-I23*G17","v":-1.5429692982873597},null,null,null,null,{"$f":"-(O24)*Q21","v":0.33803698549021272}]
[null,null,null,12,null,"KN",{"$f":"(4*G12/Y14)/((4*G12/Y14)+(4*L20/L36)+(4*G26/Y25))","v":0.28595847338283681},null,{"$f":"-(E21+I21)*G17","v":-6.7166268905670137},null,12,null,"KN",{"$f":"-(O21+O22+S21)*Q21","v":8.301975619849955},null,null,{"$f":"(4*Q12/Y14)/((4*Q12/Y14)+(4*Q26/Y25)+(4*L20/L36))","v":0.28595847338283681},null,null,12,null,"KN"]
[]
[null,"q =",10,null,"KN/m",null,null,null,null,null,"q =",15,null,"KN/m",null,null,null,null,"q =",10,null,"KN/m"]
[null,null,null,null,null,0,null,{"$f":"(4*L20/L36)/((4*G12/Y14)+(4*L20/L36)+(4*G26/Y25))","v":0.40357232694436901},null,null,"I =",{"$f":"(L43*H45^3/12+H45*L43*(((H45*L43*H45/2+L50*(O46-H45)*((O46-H45)/2+H45))/(L43*H45+(O46-H45)*L50))-H45/2)^2+L50*(O46-H45)^3/12+L50*(O46-H45)*(O46-((H45*L43*H45/2+L50*(O46-H45)*((O46-H45)/2+H45))/(L43*H45+(O46-H45)*L50))-(O46-H45)/2)^2)*10000","v":127.66666666666663},null,"dm4",null,{"$f":"(4*L20/L36)/((4*Q12/Y14)+(4*Q26/Y25)+(4*L20/L36))","v":0.40357232694436901},null,0]
[null,null,null,null,{"$f":"IF(OR(D36=0,D36=\"\"),0,-C19*D36*D36/2-D17*F34)","v":-23.25},null,{"$f":"(4*G26/Y25)/((4*G12/Y14)+(4*L20/L36)+(4*G26/Y25))","v":0.31046919967279418},null,{"$f":"L19*L36^2/12+K17*I34*N34^2/L36^2","v":46.738119834710744},null,null,null,null,null,{"$f":"-L19*L36^2/12-K17*N34*I34^2/L36^2","v":-45.250516528925623},null,{"$f":"(4*Q26/Y25)/((4*Q12/Y14)+(4*Q26/Y25)+(4*L20/L36))","v":0.31046919967279418},null,{"$f":"IF(OR(S36=0,S36=\"\"),0,T19*S36*S36/2+T17*R34)","v":23.25}]
[null,null,null,null,null,null,null,null,{"$f":"-(E21+I21)*H20","v":-9.4791551772424025},null,null,null,null,null,{"$f":"+I22/2","v":-4.7395775886212013}]
[null,null,null,null,null,null,null,null,{"$f":"+O23/2","v":5.3957810028649025},null,null,null,null,null,{"$f":"-(O21+O22+S21)*P20","v":10.791562005729805}]
[null,null,null,null,null,null,"dm4",null,{"$f":"-I23*H20","v":-2.1775878950084095},null,null,null,null,null,{"$f":"+I24/2","v":-1.0887939475042048},null,"dm4",null,null,null,null,null,null,null,"m"]
[null,null,null,null,null,null,null,null,{"$f":"+O25/2","v":0.21970355347860854},null,null,null,null,null,{"$f":"-(O24)*P20","v":0.43940710695721708},null,null,null,null,null,null,null,null,null,3.5]
[null,null,null,null,null,null,{"$f":"I40*G38^3/12*10000","v":62.499999999999993},null,{"$f":"-I25*H20","v":-8.8666274315308671E-2},null,null,null,null,null,{"$f":"+I26/2","v":-4.4333137157654336E-2},null,{"$f":"S40*Q38^3/12*10000","v":62.499999999999993}]
[null,null,null,null,null,null,null,null,{"$f":"+O27/2","v":8.9458136617292152E-3},null,null,null,null,null,{"$f":"-(O26)*P20","v":1.789162732345843E-2}]
[null,null,null,null,null,null,null,null,{"$f":"-I27*H20","v":-3.6102828358747859E-3},null,null,null,null,null,{"$f":"+I28/2","v":-1.8051414179373929E-3}]
[null,null,null,null,null,null,"I =",null,{"$f":"+O29/2","v":3.642525612503257E-4},null,null,null,null,null,{"$f":"-(O28)*P20","v":7.2850512250065139E-4},null,"I ="]
[null,null,null,null,null,null,null,null,{"$f":"-I29*H20","v":-1.4700225373924023E-4}]
[null,null,null,null,null,null,null,null,{"$f":"SUM(I21:J30)","v":40.613747825621502},null,null,null,null,null,{"$f":"SUM(O21:P30)","v":-39.875437098493641}]
[]
[]
[null,null,0.5,null,"m",{"$f":"+D36-C34","v":1},null,"m",2.5,null,null,null,null,{"$f":"+L36-I34","v":3},null,"m",null,{"$f":"+S36-U34","v":1},null,"m",0.5,null,"m"]
[]
[null,null,null,1.5,null,"m",null,null,null,null,null,5.5,null,"m",null,null,null,null,1.5,null,"m"]
[]
[null,null,null,null,null,null,0.5,null,"m",null,null,null,null,null,null,null,0.5,null,"m"]
[null,null,null,null,null,null,null,null,"m",null,null,null,null,null,null,null,null,null,"m"]
[null,null,null,null,null,null,null,null,0.6,null,null,null,null,null,null,null,null,null,0.6]
[]
[]
[null,null,null,null,null,null,null,null,null,null,null,1.2,null,"m"]
[]
[null,null,null,null,null,null,null,0.1,null,"m",null,null,null,null,"m"]
[null,null,null,null,null,null,null,null,null,null,null,null,null,null,0.7]
[]
[]
[]
[null,null,null,null,null,null,null,null,null,null,null,0.25,null,"m"]
[]
[null,null,null,{"$f":"IF(I12<0,I12/2,\"\")","v":-4.1625422869640589},null,null,null,null,null,{"$f":"IF(I12>0,I12/2,\"\")","v":""},null,null,null,{"$f":"IF(S10<0,S10/2,\"\")","v":""},null,null,null,null,null,{"$f":"IF(S10>0,S10/2,\"\")","v":3.9855499893649142}]
[]
[]
[null,null,null,null,null,null,null,null,null,"moment diyagramı (KNm)"]
[]
[null,null,null,null,null,null,null,{"$f":"-I31","v":-40.613747825621502}]
[null,null,null,null,null,null,null,null,null,null,null,null,null,null,null,{"$f":"O31","v":-39.875437098493641}]
[null,null,null,null,null,{"$f":"IF(E21=0,\"\",+E21)","v":-23.25},null,null,null,null,null,null,null,null,null,null,null,{"$f":"IF(S21=0,\"\",-S21)","v":-23.25}]
[]
[null,null,null,null,{"$f":"IF(I12>0,-I12,\"\")","v":""},null,null,null,{"$f":"IF(I12<0,-I12,\"\")","v":8.3250845739281178},null,null,null,null,null,{"$f":"IF(S10>0,-S10,\"\")","v":-7.9710999787298285},null,null,null,{"$f":"IF(S10<0,-S10,\"\")","v":""}]
[null,null,null,null,{"$f":"IF(D10<0,D10,\"\")","v":-9.0386632516933823},null,null,null,{"$f":"IF(D10>0,D10,\"\")","v":""},null,null,null,null,null,{"$f":"IF(N12<0,N12,\"\")","v":""},null,null,null,{"$f":"IF(N12>0,N12,\"\")","v":8.654337119763813}]
[]
[]
[null,null,null,null,null,null,null,null,null,null,null,{"$f":"+M116","v":32.335484323072976}]
[]
[]
[]
[]
[]
[]
[]
[]
[null,null,null,{"$f":"IF(D10>0,-D10/2,\"\")","v":""},null,null,null,null,null,{"$f":"IF(D10<0,-D10/2,\"\")","v":4.5193316258466911},null,null,null,{"$f":"IF(N12>0,-N12/2,\"\")","v":-4.3271685598819065},null,null,null,null,null,{"$f":"IF(N12<0,-N12/2,\"\")","v":""}]
[]
[]
[null,null,null,{"$f":"IF(I12<0,(I12+I12/2)/$Y$14,\"\")","v":-3.2862175949716259},null,null,null,null,null,{"$f":"IF(I12>0,(I12+I12/2)/$Y$14,\"\")","v":""},null,null,null,{"$f":"IF(S10<0,(S10+S10/2)/$Y$14,\"\")","v":""},null,null,null,null,null,{"$f":"IF(S10>0,(S10+S10/2)/$Y$14,\"\")","v":3.1464868337091429}]
[]
[]
[null,null,null,null,null,null,null,null,null,"kesme kuvveti diyagramı (KN)"]
[]
[]
[]
[null,null,null,null,null,null,null,{"$f":"+M112","v":47.92969285947779},null,null,null,null,null,null,null,null,null,{"$f":"IF(S21=0,\"\",T19*S36+T17)","v":27}]
[]
[null,null,null,{"$f":"IF(D77<0,D77,\"\")","v":-3.2862175949716259},null,null,null,null,null,{"$f":"IF(J77>0,J77,\"\")","v":""},null,null,null,{"$f":"IF(N77<0,N77,\"\")","v":""},null,null,null,null,null,{"$f":"IF(T77>0,T77,\"\")","v":3.1464868337091429}]
[null,null,null,{"$f":"IF(D99<0,D99,\"\")","v":-3.8737128221543067},null,null,null,null,null,{"$f":"IF(J99>0,J99,\"\")","v":""},null,null,null,{"$f":"IF(N99<0,N99,\"\")","v":""},null,null,null,null,null,{"$f":"IF(T99>0,T99,\"\")","v":3.7090016227559199}]
[]
[null,null,null,null,null,null,null,null,null,null,null,null,null,null,null,{"$f":"-M113","v":-46.57030714052221}]
[null,null,null,null,null,{"$f":"IF(E21=0,\"\",-C19*D36-D17)","v":-27}]
[null,null,null,null,null,null,null,null,{"$f":"+M114","v":2.5},null,"m"]
[]
[]
[]
[]
[]
[]
[]
[null,null,null,{"$f":"IF(D10<0,(D10+D10/2)/$Y$25,\"\")","v":-3.8737128221543067},null,null,null,null,null,{"$f":"IF(D10>0,(D10+D10/2)/$Y$25,\"\")","v":""},null,null,null,{"$f":"IF(N12<0,(N12+N12/2)/$Y$25,\"\")","v":""},null,null,null,null,null,{"$f":"IF(N12>0,(N12+N12/2)/$Y$25,\"\")","v":3.7090016227559199}]
[]
[null,"kiriş faydalı yükseklik \nd = h - d'     (m)",null,null,null,null,null,{"$f":"O46-N3","v":0.66999999999999993}]
[]
[]
[]
[null,null,null,{"$f":"IF(OR(C19=0,C19=\"\",D36=0,D36=\"\"),0,IF(OR(D17=0,D17=\"\",C34=0,C34=\"\"),1,2))","v":2},null,null,null,null,null,null,null,"sol moment     M1=",{"$f":"+I31","v":40.613747825621502},{"$f":"IF(M110=0,0,IF(M117=\"durum 1\",1,IF(M117=\"durum 2\",2,IF(M117=\"durum 3\",3))))","v":2},null,null,null,null,null,null,{"$f":"IF(OR(S36=0,S36=\"\",T19=0,T19=\"\"),0,IF(OR(T17=0,T17=\"\",U34=0,U34=\"\"),1,2))","v":2}]
[null,null,null,null,null,null,null,null,null,null,null,"sağ moment     M2=",{"$f":"-O31","v":39.875437098493641}]
[null,null,null,null,null,null,null,null,null,null,null,"tekil yük        K=",{"$f":"+K17","v":12}]
[null,null,null,null,null,null,null,null,null,null,null,"yayılı yük      Pd=",{"$f":"+L19","v":15}]
[null,null,null,null,null,null,null,null,null,null,null,"L=",{"$f":"+L36","v":5.5}]
[null,null,null,null,null,null,null,null,null,null,null,"(K=0 ise a=0 alınacak)     a=",{"$f":"IF(OR(K17=0,K17=\"\",I34=0,I34=\"\"),0,I34)","v":2.5}]
[null,null,null,null,null,null,null,null,null,null,null,"b=",{"$f":"M109-M110","v":3}]
[null,null,null,null,null,null,null,null,null,null,null,"(sol eksen kesme kuvveti)  A=",{"$f":"IF(M107>0,M108*M109+M107-M113,M108*M109-M113)","v":47.92969285947779}]
[null,null,null,null,null,null,null,null,null,null,null,"(sağ eksen kesme kuvveti)  B=",{"$f":"IF(M107>0,(M108*M109^2*0.5+M107*M110+M106-M105)/M109,(0.5*M108*M109^2+M106-M105)/M109)","v":46.57030714052221}]
[null,null,null,null,null,null,null,null,null,null,null,"(max mom yeri A'dan mesafesi)  x=",{"$f":"IF(M108*M110>M112,(M112*M110)/(M110*M108),IF(AND(M108*M110<M112,M107>M112-M108*M110),M110,IF(AND(M108*M110<M112,M107<M112-M108*M110),((M109-M110)*(M112-M108*M110-M107)/(M112-M108*M110-M107+M113))+M110,\"HATALI\")))","v":2.5}]
[null,null,null,null,null,null,null,null,null,null,null,"açıklık momenti  Mmax=",{"$f":"IF(M108*M110>M112,(M112*M114/2)-M105,IF(AND(M108*M110<M112,M107>M112-M108*M110),(((M112+M112-M110*M108)/2)*M110)-M105,IF(AND(M108*M110<M112,M107<M112-M108*M110),(((M109-M110)*(M112-M108*M110-M107)/(M112-M108*M110-M107+M113))*(M112-M110*M108-M107)/2+(M112+M112-M110*M108)*M110/2)-M105,\"HATALI\")))","v":32.335484323072976}]
[null,null,null,null,null,null,null,null,null,null,null,"x'den bağımsız hesap        Mmax=",{"$f":"IF(M108*M110>M112,(M112*(IF(M108*M110>M112,(M112*M110)/(M110*M108),IF(AND(M108*M110<M112,M107>M112-M108*M110),M110,IF(AND(M108*M110<M112,M107<M112-M108*M110),((M109-M110)*(M112-M108*M110-M107)/(M112-M108*M110-M107+M113))+M110,\"HATALI\"))))/2)-M105,IF(AND(M108*M110<M112,M107>M112-M108*M110),(((M112+M112-M110*M108)/2)*M110)-M105,IF(AND(M108*M110<M112,M107<M112-M108*M110),(((M109-M110)*(M112-M108*M110-M107)/(M112-M108*M110-M107+M113))*(M112-M110*M108-M107)/2+(M112+M112-M110*M108)*M110/2)-M105,\"HATALI\")))","v":32.335484323072976}]
[null,null,null,null,null,null,null,null,null,null,null,"durum",{"$f":"IF(M108*M110>M112,\"durum 1\",IF(AND(M108*M110<M112,M107>M112-M108*M110),\"durum 2\",IF(AND(M108*M110<M112,M107<M112-M108*M110),\"durum 3\",\"HATALI\")))","v":"durum 2"}]
[null,null,null,null,null,null,null,null,null,null,null,"sol mesnet (kolon genişliği) s1=",{"$f":"+G38","v":0.5}]
[null,null,null,null,null,null,null,null,null,null,null,"sağ mesnet (kolon genişliği) s2=",{"$f":"+Q38","v":0.5}]
[null,null,null,null,null,null,null,null,null,null,null,"kiriş d yüksekliği=",{"$f":"+H101","v":0.66999999999999993}]
[null,null,null,null,null,null,null,null,null,null,null,"kiriş h yüksekliği=",{"$f":"+O46","v":0.7}]
[null,null,null,null,null,null,null,null,null,null,null,"sol kolon yüzünden d mesafede kesme kuvveti"]
[null,null,null,null,null,null,null,null,null,null,null,"durum 1 için",{"$f":"IF(M114>(M120+M118/2),M112-M108*(M118/2+M120),IF(AND(M114<(M120+M118/2),(M120+M118/2)<M110),M108*(M120+M118/2)-M112,IF((M120+M118/2)=M110,M113-M108*M111,M108*M110-M112+M107+(M120+M118/2-M110)*M108)))","v":34.129692859477792}]
[null,null,null,null,null,null,null,null,null,null,null,"durum 2 için",{"$f":"IF(M120+M118/2<M110,M112-(M120+M118/2)*M108,IF((M118/2+M120)=M110,M112-M108*M110,IF(M120+M118/2>M110,M107-M112+M108*M110+(M120+M118/2-M110)*M108,0)))","v":34.129692859477792}]
[null,null,null,null,null,null,null,null,null,null,null,"durum 3 için",{"$f":"IF((M120+M118/2)<M110,M112-(M120+M118/2)*M108,IF(AND(M110<(M120+M118/2),(M120+M118/2)<M114),M112-M108*M110-M107-(M120+M118/2-M110)*M108,IF((M120+M118/2)>M114,(M120+M118/2-M114)*M108,IF((M120+M118/2)=M110,M112-M108*M110,0))))","v":34.129692859477792}]
[null,null,null,null,null,null,null,null,null,null,null,"sağ kolon yüzünden d mesafede kesme kuvveti"]
[null,null,null,null,null,null,null,null,null,null,null,"durum 1 için",{"$f":"IF((M120+M119/2)<M111,M113-(M120+M119/2)*M108,IF(AND((M120+M119/2)>M111,(M120+M119/2)<(M109-M114)),M113-M111*M108-M107-(M120+M119/2-M111)*M108,IF((M120+M119/2)=(M109-M110),M107+M108*M110-M112,((M120+M119/2)-(M109-M114))*M108)))","v":32.770307140522213}]
[null,null,null,null,null,null,null,null,null,null,null,"durum 2 için",{"$f":"IF((M120+M119/2)<M111,M113-(M120+M119/2)*M108,IF((M120+M119/2)=M111,M107-M112+M108*M110,IF((M120+M119/2)>M111,M112-(M109-(M120+M119/2))*M108,0)))","v":32.770307140522213}]
[null,null,null,null,null,null,null,null,null,null,null,"durum 3 için",{"$f":"IF((M109-M114)>(M120+M119/2),M113-(M120+M119/2)*M108,IF(AND((M120+M119/2)>(M109-M114),(M109-M110)>(M120+M119/2)),((M120+M119/2)-(M109-M114))*M108,IF(M120+M119/2>(M109-M110),M112-(M109-(M120+M119/2))*M108,IF((M120+M119/2)=(M109-M110),M112-M108*M110-M107,0))))","v":32.770307140522213}]
[null,null,null,null,null,null,null,null,null,null,null,"sol kolon yüzünden 2h mesafede kesme kuvveti"]
[null,null,null,null,null,null,null,null,null,null,null,"durum 1 için",{"$f":"IF(M114>(M121*2+M118/2),M112-M108*(M118/2+M121*2),IF(AND(M114<(M121*2+M118/2),(M121*2+M118/2)<M110),M108*(M121*2+M118/2)-M112,IF((M121*2+M118/2)=M110,M113-M108*M111,M108*M110-M112+M107+(M121*2+M118/2-M110)*M108)))","v":23.17969285947779}]
[null,null,null,null,null,null,null,null,null,null,null,"durum 2 için",{"$f":"IF(M121*2+M118/2<M110,M112-(M121*2+M118/2)*M108,IF((M118/2+M121*2)=M110,M112-M108*M110,IF(M121*2+M118/2>M110,M107-M112+M108*M110+(M121*2+M118/2-M110)*M108,0)))","v":23.17969285947779}]
[null,null,null,null,null,null,null,null,null,null,null,"durum 3 için",{"$f":"IF((M121*2+M118/2)<M110,M112-(M121*2+M118/2)*M108,IF(AND(M110<(M121*2+M118/2),(M121*2+M118/2)<M114),M112-M108*M110-M107-(M121*2+M118/2-M110)*M108,IF((M121*2+M118/2)>M114,(M121*2+M118/2-M114)*M108,IF((M121*2+M118/2)=M110,M112-M108*M110,0))))","v":23.17969285947779}]
[null,null,null,null,null,null,null,null,null,null,null,"sağ kolon yüzünden 2h mesafede kesme kuvveti"]
[null,null,null,null,null,null,null,null,null,null,null,"durum 1 için",{"$f":"IF((M121*2+M119/2)<M111,M113-(M121*2+M119/2)*M108,IF(AND((M121*2+M119/2)>M111,(M121*2+M119/2)<(M109-M114)),M113-M111*M108-M107-(M121*2+M119/2-M111)*M108,IF((M121*2+M119/2)=(M109-M110),M107+M108*M110-M112,((M121*2+M119/2)-(M109-M114))*M108)))","v":21.82030714052221}]
[null,null,null,null,null,null,null,null,null,null,null,"durum 2 için",{"$f":"IF((M121*2+M119/2)<M111,M113-(M121*2+M119/2)*M108,IF((M121*2+M119/2)=M111,M107-M112+M108*M110,IF((M121*2+M119/2)>M111,M112-(M109-(M121*2+M119/2))*M108,0)))","v":21.82030714052221}]
[null,null,null,null,null,null,null,null,null,null,null,"durum 3 için",{"$f":"IF((M109-M114)>(M121*2+M119/2),M113-(M121*2+M119/2)*M108,IF(AND((M121*2+M119/2)>(M109-M114),(M109-M110)>(M121*2+M119/2)),((M121*2+M119/2)-(M109-M114))*M108,IF(M121*2+M119/2>(M109-M110),M112-(M109-(M121*2+M119/2))*M108,IF((M121*2+M119/2)=(M109-M110),M112-M108*M110,0))))","v":21.82030714052221}]
[null,null,null,null,null,null,null,null,null,null,null,"sol kolon yüzünden d mesafede kesme kuvveti=",{"$f":"IF(M117=\"durum 1\",M123,IF(M117=\"durum 2\",M124,IF(M117=\"durum 3\",M125,\"hatalı\")))","v":34.129692859477792}]
[null,null,null,null,null,null,null,null,null,null,null,"sağ kolon yüzünden d mesafede kesme kuvveti=",{"$f":"IF(M117=\"durum 1\",M127,IF(M117=\"durum 2\",M128,IF(M117=\"durum 3\",M129,\"hatalı\")))","v":32.770307140522213}]
[null,null,null,null,null,null,null,null,null,null,null,"sol kolon yüzünden 2h mesafede kesme kuvveti=",{"$f":"IF(M117=\"durum 1\",M131,IF(M117=\"durum 2\",M132,IF(M117=\"durum 3\",M133,\"hatalı\")))","v":23.17969285947779}]
[null,null,null,null,null,null,null,null,null,null,null,"sağ kolon yüzünden 2h mesafede kesme kuvveti=",{"$f":"IF(M117=\"durum 1\",M135,IF(M117=\"durum 2\",M136,IF(M117=\"durum 3\",M137,\"hatalı\")))","v":21.82030714052221}]
[null,"kiriş kolon yüzünden d mesafede kesme kuvveti (KN)",null,null,null,null,null,{"$f":"+M138","v":34.129692859477792},null,null,null,null,null,null,{"$f":"+M139","v":32.770307140522213}]
[]
[]
[]
[]
[null,"kiriş kolon yüzünden 2*h mesafede kesme kuvveti (KN)",null,null,null,null,null,{"$f":"+M140","v":23.17969285947779},null,null,null,null,null,null,{"$f":"+M141","v":21.82030714052221}]
[]
[]
[]
[]
[null,"kiriş kolon yüzü kesme kuvveti (KN)",null,null,null,null,null,{"$f":"+M112-L19*G38/2","v":44.17969285947779},null,null,null,null,null,null,{"$f":"+M113-Q38/2*L19","v":42.82030714052221}]
[]
[]
[null,"kiriş kolon yüzü moment (KNm)",null,null,null,null,null,{"$f":"+M105-(M112+H152)/2*G38/2","v":29.100074610752053},null,null,null,null,null,null,{"$f":"+M106-(O152+M113)/2*Q38/2","v":28.701610313363091}]

{"sheet":"2_aciklikli","index":1,"n_rows":155,"n_cols":34,"rows_kept":155,"cut":false,"hidden":false,"merged":[[5,28,6,28],[9,6,10,6],[9,8,9,9],[9,13,9,14],[9,16,10,16],[9,18,9,19],[9,23,9,24],[9,26,10,26],[1,1,1,35],[2,13,2,14],[3,6,3,7],[3,16,3,17],[3,26,3,27],[5,8,6,8],[5,18,6,18],[9,28,9,29],[10,3,10,4],[10,28,10,29],[10,23,10,24],[11,3,11,4],[9,3,9,4],[11,6,13,6],[11,8,11,9],[11,16,13,16],[13,8,13,9],[13,13,13,14],[13,18,13,19],[10,8,10,9],[10,13,10,14],[10,18,10,19],[11,28,11,29],[13,33,15,33],[12,3,12,4],[14,6,15,6],[14,8,14,9],[14,13,14,14],[14,16,15,16],[14,18,14,19],[14,23,14,24],[11,23,11,24],[11,26,13,26],[12,28,12,29],[13,3,13,4],[15,8,15,9],[15,13,15,14],[15,18,15,19],[15,23,15,24],[13,28,13,29],[12,13,12,14],[12,18,12,19],[13,23,13,24],[12,8,12,9],[11,13,11,14],[11,18,11,19],[12,23,12,24],[16,23,16,24],[16,26,18,26],[14,28,14,29],[18,2,18,3],[18,11,18,12],[18,21,18,22],[18,29,18,30],[14,3,14,4],[16,6,18,6],[16,8,16,9],[16,13,16,14],[16,16,18,16],[16,18,16,19],[14,26,15,26],[19,25,19,26],[19,27,19,28],[20,4,20,5],[20,6,22,6],[20,8,20,9],[20,14,20,15],[20,16,22,16],[20,18,20,19],[20,24,20,25],[20,26,22,26],[19,5,19,6],[19,7,19,8],[19,11,19,12],[19,15,19,16],[19,17,19,18],[19,21,19,22],[22,4,22,5],[22,8,22,9],[22,14,22,15],[22,18,22,19],[22,24,22,25],[22,28,22,29],[20,28,20,29],[21,4,21,5],[21,8,21,9],[21,14,21,15],[21,18,21,19],[21,24,21,25],[21,28,21,29],[23,24,23,25],[23,26,24,26],[23,28,23,29],[24,4,24,5],[24,8,24,9],[24,14,24,15],[24,18,24,19],[24,24,24,25],[24,28,24,29],[23,4,23,5],[23,6,24,6],[23,8,23,9],[23,14,23,15],[23,16,24,16],[23,18,23,19],[26,18,26,19],[26,24,26,25],[26,28,26,29],[24,33,26,33],[25,4,25,5],[25,6,27,6],[25,8,25,9],[25,14,25,15],[25,16,27,16],[25,18,25,19],[25,24,25,25],[25,26,27,26],[25,28,25,29],[35,3,35,4],[35,11,35,12],[35,21,35,22],[35,28,35,29],[39,8,40,8],[39,18,40,18],[39,28,40,28],[28,24,28,25],[28,26,29,26],[28,28,28,29],[29,4,29,5],[30,8,30,9],[30,14,30,15],[30,18,30,19],[30,24,30,25],[29,28,29,29],[28,4,28,5],[28,6,29,6],[28,8,28,9],[28,14,28,15],[28,16,29,16],[28,18,28,19],[33,27,33,28],[51,3,51,4],[51,9,51,10],[51,13,51,14],[51,19,51,20],[51,23,51,24],[37,6,37,7],[37,16,37,17],[37,26,37,27],[42,11,42,12],[42,21,42,22],[44,7,44,8],[44,17,44,18],[51,29,51,30],[55,17,55,18],[56,7,56,8],[56,25,56,26],[57,15,57,16],[58,5,58,6],[58,27,58,28],[45,14,47,14],[45,24,47,24],[49,11,49,12],[49,21,49,22],[61,4,61,5],[61,8,61,9],[61,14,61,15],[61,18,61,19],[61,24,61,25],[61,28,61,29],[60,4,60,5],[60,8,60,9],[60,14,60,15],[60,18,60,19],[60,24,60,25],[60,28,60,29],[73,23,73,24],[73,29,73,30],[76,3,76,4],[76,9,76,10],[76,13,76,14],[76,19,76,20],[76,23,76,24],[76,29,76,30],[64,11,64,12],[64,21,64,22],[73,3,73,4],[73,9,73,10],[73,13,73,14],[73,19,73,20],[85,29,85,30],[86,3,86,4],[86,9,86,10],[86,13,86,14],[86,19,86,20],[86,23,86,24],[86,29,86,30],[83,7,83,8],[83,17,83,18],[83,27,83,28],[85,3,85,4],[85,9,85,10],[85,13,85,14],[85,19,85,20],[85,23,85,24],[88,15,88,16],[88,25,88,26],[89,5,89,6],[90,8,90,9],[90,18,90,19],[98,3,98,4],[98,9,98,10],[98,13,98,14],[98,19,98,20],[98,23,98,24],[141,24,145,26],[146,1,150,6],[146,7,150,9],[146,10,150,13],[146,14,150,16],[146,17,150,19],[146,20,150,23],[146,24,150,26],[98,29,98,30],[100,1,103,6],[100,7,103,16],[100,17,103,26],[141,1,145,6],[141,7,145,9],[141,10,145,13],[141,14,145,16],[141,17,145,19],[141,20,145,23],[129,11,129,12],[129,21,129,22],[151,24,153,26],[154,1,156,6],[154,7,156,9],[154,10,156,13],[154,14,156,16],[154,17,156,19],[154,20,156,23],[154,24,156,26],[151,1,153,6],[151,7,153,9],[151,10,153,13],[151,14,153,16],[151,17,153,19],[151,20,153,23],[33,30,33,31],[16,10,16,11],[16,20,16,21],[16,3,16,4],[16,29,16,30],[29,8,29,9],[29,14,29,15],[29,24,29,25],[29,18,29,19],[33,2,33,3],[33,5,33,6],[33,8,33,9],[33,13,33,14],[33,18,33,19],[33,23,33,24],[27,4,27,5],[27,8,27,9],[27,14,27,15],[27,18,27,19],[27,24,27,25],[27,28,27,29],[26,4,26,5],[26,8,26,9],[26,14,26,15],[129,31,129,32],[133,11,133,12],[133,21,133,22],[133,31,133,32],[121,11,121,12],[121,21,121,22],[121,31,121,32],[125,11,125,12],[125,21,125,22],[125,31,125,32]]}
[]
[null,"SAPLAMA KİRİŞLİ ÇERÇEVE CROSS (2 AÇIKLIKLI)\n(inş.müh. Gürcan BERBEROĞLU tel: 0532 366 02 04   www.betoncelik.com )"]
[null,null,null,null,null,null,null,null,"pas payı  d ' =",null,null,null,null,0.03,null,"m",null,null,null,null,null,"dikkat sadece sarı hücrelere rakam giriniz."]
[null,null,null,null,null,null,0.3,null,"m",null,null,null,null,null,null,null,0.3,null,"m",null,null,null,null,null,null,null,0.3,null,"m"]
[null,null,null,null,null,null,null,null,"m",null,null,null,null,null,null,null,null,null,"m",null,null,null,null,null,null,null,null,null,"m"]
[null,null,null,null,null,null,null,null,0.25,null,null,null,null,null,null,null,null,null,0.4,null,null,null,null,null,null,null,null,null,0.25]
[]
[]
[]
[null,null,null,{"$f":"SUM(D11:E15)","v":-1.3486708803830836},null,null,"dm4",null,null,null,null,null,null,null,null,null,"dm4",null,null,null,null,null,null,null,null,null,"dm4",null,{"$f":"SUM(AC11:AD15)","v":4.1678900446032721}]
[null,null,null,{"$f":"-I29*G21","v":2.0599111577857079E-3},null,null,null,null,null,null,null,null,null,null,null,null,null,null,null,null,null,null,null,null,null,null,null,null,{"$f":"-Y29*AA17","v":9.9606326589655818E-4}]
[null,null,null,{"$f":"-I27*G21","v":1.6629682027783824E-2},null,null,{"$f":"I6*G4^3/12*10000","v":5.625},null,{"$f":"SUM(I13:J17)","v":-0.70775731332056879},null,null,null,null,{"$f":"SUM(N13:O17)","v":-5.2887740154226952},null,null,{"$f":"S6*Q4^3/12*10000","v":9},null,{"$f":"SUM(S13:T17)","v":-2.9604799153386523},null,null,null,null,{"$f":"SUM(X13:Y17)","v":7.9421460294384563},null,null,{"$f":"AC6*AA4^3/12*10000","v":5.625},null,{"$f":"-Y27*AA17","v":8.0412280543308862E-3}]
[null,null,null,{"$f":"-I25*G21","v":0.13425157842363866},null,null,null,null,{"$f":"-I29*G17","v":1.0810029399458529E-3},null,null,null,null,null,null,null,null,null,null,null,null,null,null,{"$f":"-Y29*AA21","v":1.8980538900139963E-3},null,null,null,null,{"$f":"-Y25*AA17","v":6.4916909232222639E-2},null,null,null,null,"m"]
[null,null,null,{"$f":"-I23*G21","v":1.08381424726738},null,null,null,null,{"$f":"-I27*G17","v":8.7269468367378693E-3},null,null,null,null,{"$f":"-(O28+S28)*Q21","v":-8.8088594067146347E-3},null,null,null,null,{"$f":"-(O28+S28)*Q17","v":-4.9309067232921585E-3},null,null,null,null,{"$f":"-Y27*AA21","v":1.5323006792419408E-2},null,null,null,null,{"$f":"-Y23*AA17","v":0.52407481491523211},null,null,null,null,3.3]
[null,null,null,{"$f":"-(E21+I21)*G21","v":-2.5854262992596717},null,null,"I =",null,{"$f":"-I25*G17","v":7.0452723371005735E-2},null,null,null,null,{"$f":"-(O26+S26)*Q21","v":-7.1114004313945267E-2},null,null,"I =",null,{"$f":"-(O26+S26)*Q17","v":-3.9807256059118064E-2},null,null,null,null,{"$f":"-Y25*AA21","v":0.12370277703695753},null,null,"I =",null,{"$f":"-(Y21+AC21)*AA17","v":3.5698610291355903}]
[null,null,null,null,null,null,null,null,{"$f":"-I23*G17","v":0.56876549419279432},null,null,null,null,{"$f":"-(O24+S24)*Q21","v":-0.57410402142517203},null,null,null,null,{"$f":"-(O24+S24)*Q17","v":-0.32136435018551912},null,null,null,null,{"$f":"-Y23*AA21","v":0.99865367508846981}]
[null,null,null,12,null,"KN",{"$f":"(4*G12/AH14)/((4*G12/AH14)+(4*L20/L36)+(4*G26/AH25))","v":0.10272177771566332},null,{"$f":"-(E21+I21)*G17","v":-1.3567834806610526},null,25,null,"KN",{"$f":"-(O21+O22+S21+S22)*Q21","v":-4.634747130276863},null,null,{"$f":"(4*Q12/AH14)/((4*Q12/AH14)+(4*V20/V36)+(4*Q26/AH25)+(4*L20/L36))","v":9.6387700034568369E-2},null,{"$f":"-(O21+O22+S21+S22)*Q17","v":-2.5943774023707231},null,25,null,"KN",{"$f":"-(Y21+AC21)*AA21","v":6.8025685166305951},null,null,{"$f":"(4*AA12/AH14)/((4*AA12/AH14)+(4*AA26/AH25)+(4*V20/V36))","v":0.12169340559102861},null,null,12,null,"KN"]
[]
[null,"q =",10,null,"KN/m",null,null,null,null,null,"q =",25,null,"KN/m",null,null,null,null,null,null,"q =",25,null,"KN/m",null,null,null,null,"q =",10,null,"KN/m"]
[null,null,null,null,null,0,null,{"$f":"(4*L20/L36)/((4*G12/AH14)+(4*L20/L36)+(4*G26/AH25))","v":0.7015361680817116},null,null,"I =",{"$f":"(L43*H45^3/12+H45*L43*(((H45*L43*H45/2+L50*(O46-H45)*((O46-H45)/2+H45))/(L43*H45+(O46-H45)*L50))-H45/2)^2+L50*(O46-H45)^3/12+L50*(O46-H45)*(O46-((H45*L43*H45/2+L50*(O46-H45)*((O46-H45)/2+H45))/(L43*H45+(O46-H45)*L50))-(O46-H45)/2)^2)*10000","v":40.744047619047628},null,"dm4",null,{"$f":"(4*L20/L36)/((4*Q12/AH14)+(4*V20/V36)+(4*Q26/AH25)+(4*L20/L36))","v":0.41142357562941184},null,{"$f":"(4*V20/V36)/((4*Q12/AH14)+(4*V20/V36)+(4*Q26/AH25)+(4*L20/L36))","v":0.31999611437843145},null,null,"I =",{"$f":"(V43*R45^3/12+R45*V43*(((R45*V43*R45/2+V50*(Y46-R45)*((Y46-R45)/2+R45))/(V43*R45+(Y46-R45)*V50))-R45/2)^2+V50*(Y46-R45)^3/12+V50*(Y46-R45)*(Y46-((R45*V43*R45/2+V50*(Y46-R45)*((Y46-R45)/2+R45))/(V43*R45+(Y46-R45)*V50))-(Y46-R45)/2)^2)*10000","v":40.744047619047628},null,"dm4",null,{"$f":"(4*V20/V36)/((4*AA12/AH14)+(4*AA26/AH25)+(4*V20/V36))","v":0.64641304931051147},null,0]
[null,null,null,null,{"$f":"IF(OR(D36=0,D36=\"\"),0,-C19*D36*D36/2-D17*F34)","v":-23.25},null,{"$f":"(4*G26/AH25)/((4*G12/AH14)+(4*L20/L36)+(4*G26/AH25))","v":0.19574205420262505},null,{"$f":"L19*L36^2/12+K17*I34*N34^2/L36^2","v":36.458333333333329},null,null,null,null,null,{"$f":"-L19*L36^2/12-K17*N34*I34^2/L36^2","v":-36.458333333333329},null,{"$f":"(4*Q26/AH25)/((4*Q12/AH14)+(4*V20/V36)+(4*Q26/AH25)+(4*L20/L36))","v":0.17219260995758823},null,{"$f":"V19*V36^2/12+U17*S34*X34^2/V36^2","v":58.526234567901234},null,null,null,null,null,{"$f":"-V19*V36^2/12-U17*X34*S34^2/V36^2","v":-52.584876543209873},null,{"$f":"(4*AA26/AH25)/((4*AA12/AH14)+(4*AA26/AH25)+(4*V20/V36))","v":0.23189354509846},null,{"$f":"IF(OR(AC36=0,AC36=\"\"),0,AD19*AC36*AC36/2+AD17*AB34)","v":23.25}]
[null,null,null,null,null,null,null,null,{"$f":"-(E21+I21)*H20","v":-9.2661235534126032},null,null,null,null,null,{"$f":"+I22/2","v":-4.6330617767063016},null,null,null,{"$f":"+Y22/2","v":9.4812234987218442},null,null,null,null,null,{"$f":"-(Y21+AC21)*Z20","v":18.962446997443688}]
[null,null,null,null,null,null,null,null,{"$f":"+O23/2","v":-5.5369514317319615},null,null,null,null,null,{"$f":"-(O21+O22+S21+S22)*P20","v":-11.073902863463923},null,null,null,{"$f":"-(O21+O22+S21+S22)*R20","v":-8.6130355604719409},null,null,null,null,null,{"$f":"+S23/2","v":-4.3065177802359704}]
[null,null,null,null,null,null,"dm4",null,{"$f":"-I23*H20","v":3.8843716902717871},null,null,null,null,null,{"$f":"+I24/2","v":1.9421858451358935},null,"dm4",null,{"$f":"+Y24/2","v":1.3918946451161345},null,null,null,null,null,{"$f":"-Y23*Z20","v":2.783789290232269},null,"dm4",null,null,null,null,null,null,"m"]
[null,null,null,null,null,null,null,null,{"$f":"+O25/2","v":-0.68585965836787588},null,null,null,null,null,{"$f":"-(O24+S24)*P20","v":-1.3717193167357518},null,null,null,{"$f":"-(O24+S24)*R20","v":-1.0668928019055848},null,null,null,null,null,{"$f":"+S25/2","v":-0.53344640095279239},null,null,null,null,null,null,null,null,3.3]
[null,null,null,null,null,null,{"$f":"I40*G38^3/12*10000","v":10.718749999999996},null,{"$f":"-I25*H20","v":0.48115535657323144},null,null,null,null,null,{"$f":"+I26/2","v":0.24057767828661572},null,{"$f":"S40*Q38^3/12*10000","v":16.078124999999996},null,{"$f":"+Y26/2","v":0.17241335734180613},null,null,null,null,null,{"$f":"-Y25*Z20","v":0.34482671468361226},null,{"$f":"AC40*AA38^3/12*10000","v":10.718749999999996}]
[null,null,null,null,null,null,null,null,{"$f":"+O27/2","v":-8.4957124290569577E-2},null,null,null,null,null,{"$f":"-(O26+S26)*P20","v":-0.16991424858113915},null,null,null,{"$f":"-(O26+S26)*R20","v":-0.13215552667421934},null,null,null,null,null,{"$f":"+S27/2","v":-6.6077763337109671E-2}]
[null,null,null,null,null,null,null,null,{"$f":"-I27*H20","v":5.9600495426047881E-2},null,null,null,null,null,{"$f":"+I28/2","v":2.980024771302394E-2},null,null,null,{"$f":"+Y28/2","v":2.1356764245179689E-2},null,null,null,null,null,{"$f":"-Y27*Z20","v":4.2713528490359379E-2}]
[null,null,null,null,null,null,"I =",null,{"$f":"+O29/2","v":-1.0523600389180359E-2},null,null,null,null,null,{"$f":"-(O28+S28)*P20","v":-2.1047200778360718E-2},null,"I =",null,{"$f":"-(O28+S28)*R20","v":-1.6370045049836114E-2},null,null,null,null,null,{"$f":"+S29/2","v":-8.1850225249180571E-3},null,"I ="]
[null,null,null,null,null,null,null,null,{"$f":"-I29*H20","v":7.3826862914487977E-3},null,null,null,null,null,null,null,null,null,null,null,null,null,null,null,{"$f":"-Y29*Z20","v":5.2909053690075028E-3}]
[null,null,null,null,null,null,null,null,{"$f":"SUM(I21:J30)","v":25.306428193703656},null,null,null,null,null,{"$f":"SUM(O21:P30)","v":-51.515414968463261},null,null,null,{"$f":"SUM(S21:T30)","v":59.764668899224596},null,null,null,null,null,{"$f":"SUM(Y21:Z30)","v":-35.360036074041723}]
[]
[]
[null,null,0.5,null,"m",{"$f":"+D36-C34","v":1},null,"m",1.75,null,"m",null,null,{"$f":"+L36-I34","v":1.75},null,"m",null,null,1.75,null,"m",null,null,{"$f":"+V36-S34","v":2.75},null,"m",null,{"$f":"+AC36-AE34","v":1},null,"m",0.5,null,"m"]
[]
[null,null,null,1.5,null,"m",null,null,null,null,null,3.5,null,"m",null,null,null,null,null,null,null,4.5,null,"m",null,null,null,null,1.5,null,"m"]
[]
[null,null,null,null,null,null,0.35,null,"m",null,null,null,null,null,null,null,0.35,null,"m",null,null,null,null,null,null,null,0.35,null,"m"]
[null,null,null,null,null,null,null,null,"m",null,null,null,null,null,null,null,null,null,"m",null,null,null,null,null,null,null,null,null,"m"]
[null,null,null,null,null,null,null,null,0.3,null,null,null,null,null,null,null,null,null,0.45,null,null,null,null,null,null,null,null,null,0.3]
[]
[]
[null,null,null,null,null,null,null,null,null,null,null,0.75,null,"m",null,null,null,null,null,null,null,0.75,null,"m"]
[]
[null,null,null,null,null,null,null,0.1,null,"m",null,null,null,null,"m",null,null,0.1,null,"m",null,null,null,null,"m"]
[null,null,null,null,null,null,null,null,null,null,null,null,null,null,0.5,null,null,null,null,null,null,null,null,null,0.5]
[]
[]
[]
[null,null,null,null,null,null,null,null,null,null,null,0.25,null,"m",null,null,null,null,null,null,null,0.25,null,"m"]
[]
[null,null,null,{"$f":"IF(I12<0,I12/2,\"\")","v":-0.3538786566602844},null,null,null,null,null,{"$f":"IF(I12>0,I12/2,\"\")","v":""},null,null,null,{"$f":"IF(S12<0,S12/2,\"\")","v":-1.4802399576693261},null,null,null,null,null,{"$f":"IF(S12>0,S12/2,\"\")","v":""},null,null,null,{"$f":"IF(AC10<0,AC10/2,\"\")","v":""},null,null,null,null,null,{"$f":"IF(AC10>0,AC10/2,\"\")","v":2.083945022301636}]
[]
[]
[null,null,null,null,null,null,null,null,null,"moment diyagramı (KNm)"]
[null,null,null,null,null,null,null,null,null,null,null,null,null,null,null,null,null,{"$f":"-S31","v":-59.764668899224596}]
[null,null,null,null,null,null,null,{"$f":"-I31","v":-25.306428193703656},null,null,null,null,null,null,null,null,null,null,null,null,null,null,null,null,null,{"$f":"Y31","v":-35.360036074041723}]
[null,null,null,null,null,null,null,null,null,null,null,null,null,null,null,{"$f":"O31","v":-51.515414968463261}]
[null,null,null,null,null,{"$f":"IF(E21=0,\"\",+E21)","v":-23.25},null,null,null,null,null,null,null,null,null,null,null,null,null,null,null,null,null,null,null,null,null,{"$f":"IF(AC21=0,\"\",-AC21)","v":-23.25}]
[]
[null,null,null,null,{"$f":"IF(I12>0,-I12,\"\")","v":""},null,null,null,{"$f":"IF(I12<0,-I12,\"\")","v":0.70775731332056879},null,null,null,null,null,{"$f":"IF(S12>0,-S12,\"\")","v":""},null,null,null,{"$f":"IF(S12<0,-S12,\"\")","v":2.9604799153386523},null,null,null,null,null,{"$f":"IF(AC10>0,-AC10,\"\")","v":-4.1678900446032721},null,null,null,{"$f":"IF(AC10<0,-AC10,\"\")","v":""}]
[null,null,null,null,{"$f":"IF(D10<0,D10,\"\")","v":-1.3486708803830836},null,null,null,{"$f":"IF(D10>0,D10,\"\")","v":""},null,null,null,null,null,{"$f":"IF(N12<0,N12,\"\")","v":-5.2887740154226952},null,null,null,{"$f":"IF(N12>0,N12,\"\")","v":""},null,null,null,null,null,{"$f":"IF(X12<0,X12,\"\")","v":""},null,null,null,{"$f":"IF(X12>0,X12,\"\")","v":7.9421460294384563}]
[]
[]
[null,null,null,null,null,null,null,null,null,null,null,{"$f":"+M116","v":21.745328418916539},null,null,null,null,null,null,null,null,null,{"$f":"+W116","v":37.963520457691281}]
[]
[]
[]
[]
[]
[]
[]
[]
[null,null,null,{"$f":"IF(D10>0,-D10/2,\"\")","v":""},null,null,null,null,null,{"$f":"IF(D10<0,-D10/2,\"\")","v":0.67433544019154179},null,null,null,{"$f":"IF(N12>0,-N12/2,\"\")","v":""},null,null,null,null,null,{"$f":"IF(N12<0,-N12/2,\"\")","v":2.6443870077113476},null,null,null,{"$f":"IF(X12>0,-X12/2,\"\")","v":-3.9710730147192281},null,null,null,null,null,{"$f":"IF(X12<0,-X12/2,\"\")","v":""}]
[]
[]
[null,null,null,{"$f":"IF(I12<0,(I12+I12/2)/$AH$14,\"\")","v":-0.32170786969116766},null,null,null,null,null,{"$f":"IF(I12>0,(I12+I12/2)/$AH$14,\"\")","v":""},null,null,null,{"$f":"IF(S12<0,(S12+S12/2)/$AH$14,\"\")","v":-1.3456726887902966},null,null,null,null,null,{"$f":"IF(S12>0,(S12+S12/2)/$AH$14,\"\")","v":""},null,null,null,{"$f":"IF(AC10<0,(AC10+AC10/2)/$AH$14,\"\")","v":""},null,null,null,null,null,{"$f":"IF(AC10>0,(AC10+AC10/2)/$AH$14,\"\")","v":1.8944954748196692}]
[]
[]
[null,null,null,null,null,null,null,null,null,"kesme kuvveti diyagramı (KN)"]
[]
[]
[]
[null,null,null,null,null,null,null,{"$f":"+M112","v":48.761718064354397},null,null,null,null,null,null,null,null,null,{"$f":"+W112","v":76.951029516707308},null,null,null,null,null,null,null,null,null,{"$f":"IF(AC21=0,\"\",AD19*AC36+AD17)","v":27}]
[]
[null,null,null,{"$f":"IF(D77<0,D77,\"\")","v":-0.32170786969116766},null,null,null,null,null,{"$f":"IF(J77>0,J77,\"\")","v":""},null,null,null,{"$f":"IF(N77<0,N77,\"\")","v":-1.3456726887902966},null,null,null,null,null,{"$f":"IF(T77>0,T77,\"\")","v":""},null,null,null,{"$f":"IF(X77<0,X77,\"\")","v":""},null,null,null,null,null,{"$f":"IF(AD77>0,AD77,\"\")","v":1.8944954748196692}]
[null,null,null,{"$f":"IF(D99<0,D99,\"\")","v":-0.61303221835594701},null,null,null,null,null,{"$f":"IF(J99>0,J99,\"\")","v":""},null,null,null,{"$f":"IF(N99<0,N99,\"\")","v":-2.4039881888284977},null,null,null,null,null,{"$f":"IF(T99>0,T99,\"\")","v":""},null,null,null,{"$f":"IF(X99<0,X99,\"\")","v":""},null,null,null,null,null,{"$f":"IF(AD99>0,AD99,\"\")","v":3.6100663770174806}]
[]
[null,null,null,null,null,null,null,null,null,null,null,null,null,null,null,{"$f":"-M113","v":-63.738281935645603},null,null,null,null,null,null,null,null,null,{"$f":"-W113","v":-60.548970483292692}]
[null,null,null,null,null,{"$f":"IF(E21=0,\"\",-C19*D36-D17)","v":-27}]
[null,null,null,null,null,null,null,null,{"$f":"+M114","v":1.75},null,"m",null,null,null,null,null,null,null,{"$f":"+W114","v":2.0780411806682926},null,"m"]
[]
[]
[]
[]
[]
[]
[]
[null,null,null,{"$f":"IF(D10<0,(D10+D10/2)/$AH$25,\"\")","v":-0.61303221835594701},null,null,null,null,null,{"$f":"IF(D10>0,(D10+D10/2)/$AH$25,\"\")","v":""},null,null,null,{"$f":"IF(N12<0,(N12+N12/2)/$AH$25,\"\")","v":-2.4039881888284977},null,null,null,null,null,{"$f":"IF(N12>0,(N12+N12/2)/$AH$25,\"\")","v":""},null,null,null,{"$f":"IF(X12<0,(X12+X12/2)/$AH$25,\"\")","v":""},null,null,null,null,null,{"$f":"IF(X12>0,(X12+X12/2)/$AH$25,\"\")","v":3.6100663770174806}]
[]
[null,"kiriş faydalı yükseklik \nd = h - d'     (m)",null,null,null,null,null,{"$f":"O46-N3","v":0.47},null,null,null,null,null,null,null,null,null,{"$f":"Y46-N3","v":0.47}]
[]
[]
[]
[null,null,null,{"$f":"IF(OR(C19=0,C19=\"\",D36=0,D36=\"\"),0,IF(OR(D17=0,D17=\"\",C34=0,C34=\"\"),1,2))","v":2},null,null,null,null,null,null,null,"sol moment     M1=",{"$f":"+I31","v":25.306428193703656},{"$f":"IF(M110=0,0,IF(M117=\"durum 1\",1,IF(M117=\"durum 2\",2,IF(M117=\"durum 3\",3))))","v":2},null,null,null,null,null,null,null,"sol moment     M1=",{"$f":"+S31","v":59.764668899224596},{"$f":"IF(W110=0,0,IF(W117=\"durum 1\",1,IF(W117=\"durum 2\",2,IF(W117=\"durum 3\",3))))","v":3},null,null,null,null,null,null,{"$f":"IF(OR(AC36=0,AC36=\"\",AD19=0,AD19=\"\"),0,IF(OR(AD17=0,AD17=\"\",AE34=0,AE34=\"\"),1,2))","v":2}]
[null,null,null,null,null,null,null,null,null,null,null,"sağ moment     M2=",{"$f":"-O31","v":51.515414968463261},null,null,null,null,null,null,null,null,"sağ moment     M2=",{"$f":"-Y31","v":35.360036074041723}]
[null,null,null,null,null,null,null,null,null,null,null,"tekil yük        K=",{"$f":"+K17","v":25},null,null,null,null,null,null,null,null,"tekil yük        K=",{"$f":"+U17","v":25}]
[null,null,null,null,null,null,null,null,null,null,null,"yayılı yük      Pd=",{"$f":"+L19","v":25},null,null,null,null,null,null,null,null,"yayılı yük      Pd=",{"$f":"+V19","v":25}]
[null,null,null,null,null,null,null,null,null,null,null,"L=",{"$f":"+L36","v":3.5},null,null,null,null,null,null,null,null,"L=",{"$f":"+V36","v":4.5}]
[null,null,null,null,null,null,null,null,null,null,null,"(K=0 ise a=0 alınacak)     a=",{"$f":"IF(OR(K17=0,K17=\"\",I34=0,I34=\"\"),0,I34)","v":1.75},null,null,null,null,null,null,null,null,"(K=0 ise a=0 alınacak)     a=",{"$f":"IF(OR(U17=0,U17=\"\",S34=0,S34=\"\"),0,S34)","v":1.75}]
[null,null,null,null,null,null,null,null,null,null,null,"b=",{"$f":"M109-M110","v":1.75},null,null,null,null,null,null,null,null,"b=",{"$f":"W109-W110","v":2.75}]
[null,null,null,null,null,null,null,null,null,null,null,"(sol eksen kesme kuvveti)  A=",{"$f":"IF(M107>0,M108*M109+M107-M113,M108*M109-M113)","v":48.761718064354397},null,null,null,null,null,null,null,null,"(sol eksen kesme kuvveti)  A=",{"$f":"IF(W107>0,W108*W109+W107-W113,W108*W109-W113)","v":76.951029516707308}]
[null,null,null,null,null,null,null,null,null,null,null,"(sağ eksen kesme kuvveti)  B=",{"$f":"IF(M107>0,(M108*M109^2*0.5+M107*M110+M106-M105)/M109,(0.5*M108*M109^2+M106-M105)/M109)","v":63.738281935645603},null,null,null,null,null,null,null,null,"(sağ eksen kesme kuvveti)  B=",{"$f":"IF(W107>0,(W108*W109^2*0.5+W107*W110+W106-W105)/W109,(0.5*W108*W109^2+W106-W105)/W109)","v":60.548970483292692}]
[null,null,null,null,null,null,null,null,null,null,null,"(max mom yeri A'dan mesafesi)  x=",{"$f":"IF(M108*M110>M112,(M112*M110)/(M110*M108),IF(AND(M108*M110<M112,M107>M112-M108*M110),M110,IF(AND(M108*M110<M112,M107<M112-M108*M110),((M109-M110)*(M112-M108*M110-M107)/(M112-M108*M110-M107+M113))+M110,\"HATALI\")))","v":1.75},null,null,null,null,null,null,null,null,"(max mom yeri A'dan mesafesi)  x=",{"$f":"IF(W108*W110>W112,(W112*W110)/(W110*W108),IF(AND(W108*W110<W112,W107>W112-W108*W110),W110,IF(AND(W108*W110<W112,W107<W112-W108*W110),((W109-W110)*(W112-W108*W110-W107)/(W112-W108*W110-W107+W113))+W110,\"HATALI\")))","v":2.0780411806682926}]
[null,null,null,null,null,null,null,null,null,null,null,"açıklık momenti  Mmax=",{"$f":"IF(M108*M110>M112,(M112*M114/2)-M105,IF(AND(M108*M110<M112,M107>M112-M108*M110),(((M112+M112-M110*M108)/2)*M110)-M105,IF(AND(M108*M110<M112,M107<M112-M108*M110),(((M109-M110)*(M112-M108*M110-M107)/(M112-M108*M110-M107+M113))*(M112-M110*M108-M107)/2+(M112+M112-M110*M108)*M110/2)-M105,\"HATALI\")))","v":21.745328418916539},null,null,null,null,null,null,null,null,"açıklık momenti  Mmax=",{"$f":"IF(W108*W110>W112,(W112*W114/2)-W105,IF(AND(W108*W110<W112,W107>W112-W108*W110),(((W112+W112-W110*W108)/2)*W110)-W105,IF(AND(W108*W110<W112,W107<W112-W108*W110),(((W109-W110)*(W112-W108*W110-W107)/(W112-W108*W110-W107+W113))*(W112-W110*W108-W107)/2+(W112+W112-W110*W108)*W110/2)-W105,\"HATALI\")))","v":37.963520457691281}]
[null,null,null,null,null,null,null,null,null,null,null,"x'den bağımsız hesap        Mmax=",{"$f":"IF(M108*M110>M112,(M112*(IF(M108*M110>M112,(M112*M110)/(M110*M108),IF(AND(M108*M110<M112,M107>M112-M108*M110),M110,IF(AND(M108*M110<M112,M107<M112-M108*M110),((M109-M110)*(M112-M108*M110-M107)/(M112-M108*M110-M107+M113))+M110,\"HATALI\"))))/2)-M105,IF(AND(M108*M110<M112,M107>M112-M108*M110),(((M112+M112-M110*M108)/2)*M110)-M105,IF(AND(M108*M110<M112,M107<M112-M108*M110),(((M109-M110)*(M112-M108*M110-M107)/(M112-M108*M110-M107+M113))*(M112-M110*M108-M107)/2+(M112+M112-M110*M108)*M110/2)-M105,\"HATALI\")))","v":21.745328418916539},null,null,null,null,null,null,null,null,"x'den bağımsız hesap        Mmax=",{"$f":"IF(W108*W110>W112,(W112*(IF(W108*W110>W112,(W112*W110)/(W110*W108),IF(AND(W108*W110<W112,W107>W112-W108*W110),W110,IF(AND(W108*W110<W112,W107<W112-W108*W110),((W109-W110)*(W112-W108*W110-W107)/(W112-W108*W110-W107+W113))+W110,\"HATALI\"))))/2)-W105,IF(AND(W108*W110<W112,W107>W112-W108*W110),(((W112+W112-W110*W108)/2)*W110)-W105,IF(AND(W108*W110<W112,W107<W112-W108*W110),(((W109-W110)*(W112-W108*W110-W107)/(W112-W108*W110-W107+W113))*(W112-W110*W108-W107)/2+(W112+W112-W110*W108)*W110/2)-W105,\"HATALI\")))","v":37.963520457691281}]
[null,null,null,null,null,null,null,null,null,null,null,"durum",{"$f":"IF(M108*M110>M112,\"durum 1\",IF(AND(M108*M110<M112,M107>M112-M108*M110),\"durum 2\",IF(AND(M108*M110<M112,M107<M112-M108*M110),\"durum 3\",\"HATALI\")))","v":"durum 2"},null,null,null,null,null,null,null,null,"durum",{"$f":"IF(W108*W110>W112,\"durum 1\",IF(AND(W108*W110<W112,W107>W112-W108*W110),\"durum 2\",IF(AND(W108*W110<W112,W107<W112-W108*W110),\"durum 3\",\"HATALI\")))","v":"durum 3"}]
[null,null,null,null,null,null,null,null,null,null,null,"sol mesnet (kolon genişliği) s1=",{"$f":"+G38","v":0.35},null,null,null,null,null,null,null,null,"sol mesnet (kolon genişliği) s1=",{"$f":"+Q38","v":0.35}]
[null,null,null,null,null,null,null,null,null,null,null,"sağ mesnet (kolon genişliği) s2=",{"$f":"+Q38","v":0.35},null,null,null,null,null,null,null,null,"sağ mesnet (kolon genişliği) s2=",{"$f":"+AA38","v":0.35}]
[null,null,null,null,null,null,null,null,null,null,null,"kiriş d yüksekliği=",{"$f":"+H101","v":0.47},null,null,null,null,null,null,null,null,"kiriş d yüksekliği=",{"$f":"+R101","v":0.47}]
[null,null,null,null,null,null,null,null,null,null,null,"kiriş h yüksekliği=",{"$f":"+O46","v":0.5},null,null,null,null,null,null,null,null,"kiriş h yüksekliği=",{"$f":"+Y46","v":0.5}]
[null,null,null,null,null,null,null,null,null,null,null,"sol kolon yüzünden d mesafede kesme kuvveti",null,null,null,null,null,null,null,null,null,"sol kolon yüzünden d mesafede kesme kuvveti"]
[null,null,null,null,null,null,null,null,null,null,null,"durum 1 için",{"$f":"IF(M114>(M120+M118/2),M112-M108*(M118/2+M120),IF(AND(M114<(M120+M118/2),(M120+M118/2)<M110),M108*(M120+M118/2)-M112,IF((M120+M118/2)=M110,M113-M108*M111,M108*M110-M112+M107+(M120+M118/2-M110)*M108)))","v":32.636718064354397},null,null,null,null,null,null,null,null,"durum 1 için",{"$f":"IF(W114>(W120+W118/2),W112-W108*(W118/2+W120),IF(AND(W114<(W120+W118/2),(W120+W118/2)<W110),W108*(W120+W118/2)-W112,IF((W120+W118/2)=W110,W113-W108*W111,W108*W110-W112+W107+(W120+W118/2-W110)*W108)))","v":60.826029516707308}]
[null,null,null,null,null,null,null,null,null,null,null,"durum 2 için",{"$f":"IF(M120+M118/2<M110,M112-(M120+M118/2)*M108,IF((M118/2+M120)=M110,M112-M108*M110,IF(M120+M118/2>M110,M107-M112+M108*M110+(M120+M118/2-M110)*M108,0)))","v":32.636718064354397},null,null,null,null,null,null,null,null,"durum 2 için",{"$f":"IF(W120+W118/2<W110,W112-(W120+W118/2)*W108,IF((W118/2+W120)=W110,W112-W108*W110,IF(W120+W118/2>W110,W107-W112+W108*W110+(W120+W118/2-W110)*W108,0)))","v":60.826029516707308}]
[null,null,null,null,null,null,null,null,null,null,null,"durum 3 için",{"$f":"IF((M120+M118/2)<M110,M112-(M120+M118/2)*M108,IF(AND(M110<(M120+M118/2),(M120+M118/2)<M114),M112-M108*M110-M107-(M120+M118/2-M110)*M108,IF((M120+M118/2)>M114,(M120+M118/2-M114)*M108,IF((M120+M118/2)=M110,M112-M108*M110,0))))","v":32.636718064354397},null,null,null,null,null,null,null,null,"durum 3 için",{"$f":"IF((W120+W118/2)<W110,W112-(W120+W118/2)*W108,IF(AND(W110<(W120+W118/2),(W120+W118/2)<W114),W112-W108*W110-W107-(W120+W118/2-W110)*W108,IF((W120+W118/2)>W114,(W120+W118/2-W114)*W108,IF((W120+W118/2)=W110,W112-W108*W110,0))))","v":60.826029516707308}]
[null,null,null,null,null,null,null,null,null,null,null,"sağ kolon yüzünden d mesafede kesme kuvveti",null,null,null,null,null,null,null,null,null,"sağ kolon yüzünden d mesafede kesme kuvveti"]
[null,null,null,null,null,null,null,null,null,null,null,"durum 1 için",{"$f":"IF((M120+M119/2)<M111,M113-(M120+M119/2)*M108,IF(AND((M120+M119/2)>M111,(M120+M119/2)<(M109-M114)),M113-M111*M108-M107-(M120+M119/2-M111)*M108,IF((M120+M119/2)=(M109-M110),M107+M108*M110-M112,((M120+M119/2)-(M109-M114))*M108)))","v":47.613281935645603},null,null,null,null,null,null,null,null,"durum 1 için",{"$f":"IF((W120+W119/2)<W111,W113-(W120+W119/2)*W108,IF(AND((W120+W119/2)>W111,(W120+W119/2)<(W109-W114)),W113-W111*W108-W107-(W120+W119/2-W111)*W108,IF((W120+W119/2)=(W109-W110),W107+W108*W110-W112,((W120+W119/2)-(W109-W114))*W108)))","v":44.423970483292692}]
[null,null,null,null,null,null,null,null,null,null,null,"durum 2 için",{"$f":"IF((M120+M119/2)<M111,M113-(M120+M119/2)*M108,IF((M120+M119/2)=M111,M107-M112+M108*M110,IF((M120+M119/2)>M111,M112-(M109-(M120+M119/2))*M108,0)))","v":47.613281935645603},null,null,null,null,null,null,null,null,"durum 2 için",{"$f":"IF((W120+W119/2)<W111,W113-(W120+W119/2)*W108,IF((W120+W119/2)=W111,W107-W112+W108*W110,IF((W120+W119/2)>W111,W112-(W109-(W120+W119/2))*W108,0)))","v":44.423970483292692}]
[null,null,null,null,null,null,null,null,null,null,null,"durum 3 için",{"$f":"IF((M109-M114)>(M120+M119/2),M113-(M120+M119/2)*M108,IF(AND((M120+M119/2)>(M109-M114),(M109-M110)>(M120+M119/2)),((M120+M119/2)-(M109-M114))*M108,IF(M120+M119/2>(M109-M110),M112-(M109-(M120+M119/2))*M108,IF((M120+M119/2)=(M109-M110),M112-M108*M110-M107,0))))","v":47.613281935645603},null,null,null,null,null,null,null,null,"durum 3 için",{"$f":"IF((W109-W114)>(W120+W119/2),W113-(W120+W119/2)*W108,IF(AND((W120+W119/2)>(W109-W114),(W109-W110)>(W120+W119/2)),((W120+W119/2)-(W109-W114))*W108,IF(W120+W119/2>(W109-W110),W112-(W109-(W120+W119/2))*W108,IF((W120+W119/2)=(W109-W110),W112-W108*W110-W107,0))))","v":44.423970483292692}]
[null,null,null,null,null,null,null,null,null,null,null,"sol kolon yüzünden 2h mesafede kesme kuvveti",null,null,null,null,null,null,null,null,null,"sol kolon yüzünden 2h mesafede kesme kuvveti"]
[null,null,null,null,null,null,null,null,null,null,null,"durum 1 için",{"$f":"IF(M114>(M121*2+M118/2),M112-M108*(M118/2+M121*2),IF(AND(M114<(M121*2+M118/2),(M121*2+M118/2)<M110),M108*(M121*2+M118/2)-M112,IF((M121*2+M118/2)=M110,M113-M108*M111,M108*M110-M112+M107+(M121*2+M118/2-M110)*M108)))","v":19.386718064354397},null,null,null,null,null,null,null,null,"durum 1 için",{"$f":"IF(W114>(W121*2+W118/2),W112-W108*(W118/2+W121*2),IF(AND(W114<(W121*2+W118/2),(W121*2+W118/2)<W110),W108*(W121*2+W118/2)-W112,IF((W121*2+W118/2)=W110,W113-W108*W111,W108*W110-W112+W107+(W121*2+W118/2-W110)*W108)))","v":47.576029516707308}]
[null,null,null,null,null,null,null,null,null,null,null,"durum 2 için",{"$f":"IF(M121*2+M118/2<M110,M112-(M121*2+M118/2)*M108,IF((M118/2+M121*2)=M110,M112-M108*M110,IF(M121*2+M118/2>M110,M107-M112+M108*M110+(M121*2+M118/2-M110)*M108,0)))","v":19.386718064354397},null,null,null,null,null,null,null,null,"durum 2 için",{"$f":"IF(W121*2+W118/2<W110,W112-(W121*2+W118/2)*W108,IF((W118/2+W121*2)=W110,W112-W108*W110,IF(W121*2+W118/2>W110,W107-W112+W108*W110+(W121*2+W118/2-W110)*W108,0)))","v":47.576029516707308}]
[null,null,null,null,null,null,null,null,null,null,null,"durum 3 için",{"$f":"IF((M121*2+M118/2)<M110,M112-(M121*2+M118/2)*M108,IF(AND(M110<(M121*2+M118/2),(M121*2+M118/2)<M114),M112-M108*M110-M107-(M121*2+M118/2-M110)*M108,IF((M121*2+M118/2)>M114,(M121*2+M118/2-M114)*M108,IF((M121*2+M118/2)=M110,M112-M108*M110,0))))","v":19.386718064354397},null,null,null,null,null,null,null,null,"durum 3 için",{"$f":"IF((W121*2+W118/2)<W110,W112-(W121*2+W118/2)*W108,IF(AND(W110<(W121*2+W118/2),(W121*2+W118/2)<W114),W112-W108*W110-W107-(W121*2+W118/2-W110)*W108,IF((W121*2+W118/2)>W114,(W121*2+W118/2-W114)*W108,IF((W121*2+W118/2)=W110,W112-W108*W110,0))))","v":47.576029516707308}]
[null,null,null,null,null,null,null,null,null,null,null,"sağ kolon yüzünden 2h mesafede kesme kuvveti",null,null,null,null,null,null,null,null,null,"sağ kolon yüzünden 2h mesafede kesme kuvveti"]
[null,null,null,null,null,null,null,null,null,null,null,"durum 1 için",{"$f":"IF((M121*2+M119/2)<M111,M113-(M121*2+M119/2)*M108,IF(AND((M121*2+M119/2)>M111,(M121*2+M119/2)<(M109-M114)),M113-M111*M108-M107-(M121*2+M119/2-M111)*M108,IF((M121*2+M119/2)=(M109-M110),M107+M108*M110-M112,((M121*2+M119/2)-(M109-M114))*M108)))","v":34.363281935645603},null,null,null,null,null,null,null,null,"durum 1 için",{"$f":"IF((W121*2+W119/2)<W111,W113-(W121*2+W119/2)*W108,IF(AND((W121*2+W119/2)>W111,(W121*2+W119/2)<(W109-W114)),W113-W111*W108-W107-(W121*2+W119/2-W111)*W108,IF((W121*2+W119/2)=(W109-W110),W107+W108*W110-W112,((W121*2+W119/2)-(W109-W114))*W108)))","v":31.173970483292692}]
[null,null,null,null,null,null,null,null,null,null,null,"durum 2 için",{"$f":"IF((M121*2+M119/2)<M111,M113-(M121*2+M119/2)*M108,IF((M121*2+M119/2)=M111,M107-M112+M108*M110,IF((M121*2+M119/2)>M111,M112-(M109-(M121*2+M119/2))*M108,0)))","v":34.363281935645603},null,null,null,null,null,null,null,null,"durum 2 için",{"$f":"IF((W121*2+W119/2)<W111,W113-(W121*2+W119/2)*W108,IF((W121*2+W119/2)=W111,W107-W112+W108*W110,IF((W121*2+W119/2)>W111,W112-(W109-(W121*2+W119/2))*W108,0)))","v":31.173970483292692}]
[null,null,null,null,null,null,null,null,null,null,null,"durum 3 için",{"$f":"IF((M109-M114)>(M121*2+M119/2),M113-(M121*2+M119/2)*M108,IF(AND((M121*2+M119/2)>(M109-M114),(M109-M110)>(M121*2+M119/2)),((M121*2+M119/2)-(M109-M114))*M108,IF(M121*2+M119/2>(M109-M110),M112-(M109-(M121*2+M119/2))*M108,IF((M121*2+M119/2)=(M109-M110),M112-M108*M110,0))))","v":34.363281935645603},null,null,null,null,null,null,null,null,"durum 3 için",{"$f":"IF((W109-W114)>(W121*2+W119/2),W113-(W121*2+W119/2)*W108,IF(AND((W121*2+W119/2)>(W109-W114),(W109-W110)>(W121*2+W119/2)),((W121*2+W119/2)-(W109-W114))*W108,IF(W121*2+W119/2>(W109-W110),W112-(W109-(W121*2+W119/2))*W108,IF((W121*2+W119/2)=(W109-W110),W112-W108*W110,0))))","v":31.173970483292692}]
[null,null,null,null,null,null,null,null,null,null,null,"sol kolon yüzünden d mesafede kesme kuvveti=",{"$f":"IF(M117=\"durum 1\",M123,IF(M117=\"durum 2\",M124,IF(M117=\"durum 3\",M125,\"hatalı\")))","v":32.636718064354397},null,null,null,null,null,null,null,null,"sol kolon yüzünden d mesafede kesme kuvveti=",{"$f":"IF(W117=\"durum 1\",W123,IF(W117=\"durum 2\",W124,IF(W117=\"durum 3\",W125,\"hatalı\")))","v":60.826029516707308}]
[null,null,null,null,null,null,null,null,null,null,null,"sağ kolon yüzünden d mesafede kesme kuvveti=",{"$f":"IF(M117=\"durum 1\",M127,IF(M117=\"durum 2\",M128,IF(M117=\"durum 3\",M129,\"hatalı\")))","v":47.613281935645603},null,null,null,null,null,null,null,null,"sağ kolon yüzünden d mesafede kesme kuvveti=",{"$f":"IF(W117=\"durum 1\",W127,IF(W117=\"durum 2\",W128,IF(W117=\"durum 3\",W129,\"hatalı\")))","v":44.423970483292692}]
[null,null,null,null,null,null,null,null,null,null,null,"sol kolon yüzünden 2h mesafede kesme kuvveti=",{"$f":"IF(M117=\"durum 1\",M131,IF(M117=\"durum 2\",M132,IF(M117=\"durum 3\",M133,\"hatalı\")))","v":19.386718064354397},null,null,null,null,null,null,null,null,"sol kolon yüzünden 2h mesafede kesme kuvveti=",{"$f":"IF(W117=\"durum 1\",W131,IF(W117=\"durum 2\",W132,IF(W117=\"durum 3\",W133,\"hatalı\")))","v":47.576029516707308}]
[null,null,null,null,null,null,null,null,null,null,null,"sağ kolon yüzünden 2h mesafede kesme kuvveti=",{"$f":"IF(M117=\"durum 1\",M135,IF(M117=\"durum 2\",M136,IF(M117=\"durum 3\",M137,\"hatalı\")))","v":34.363281935645603},null,null,null,null,null,null,null,null,"sağ kolon yüzünden 2h mesafede kesme kuvveti=",{"$f":"IF(W117=\"durum 1\",W135,IF(W117=\"durum 2\",W136,IF(W117=\"durum 3\",W137,\"hatalı\")))","v":31.173970483292692}]
[null,"kiriş kolon yüzünden d mesafede kesme kuvveti (KN)",null,null,null,null,null,{"$f":"+M138","v":32.636718064354397},null,null,null,null,null,null,{"$f":"+M139","v":47.613281935645603},null,null,{"$f":"+W138","v":60.826029516707308},null,null,null,null,null,null,{"$f":"+W139","v":44.423970483292692}]
[]
[]
[]
[]
[null,"kiriş kolon yüzünden 2*h mesafede kesme kuvveti (KN)",null,null,null,null,null,{"$f":"+M140","v":19.386718064354397},null,null,null,null,null,null,{"$f":"+M141","v":34.363281935645603},null,null,{"$f":"+W140","v":47.576029516707308},null,null,null,null,null,null,{"$f":"+W141","v":31.173970483292692}]
[]
[]
[]
[]
[null,"kiriş kolon yüzü kesme kuvveti (KN)",null,null,null,null,null,{"$f":"+M112-L19*G38/2","v":44.386718064354397},null,null,null,null,null,null,{"$f":"+M113-Q38/2*L19","v":59.363281935645603},null,null,{"$f":"+W112-V19*Q38/2","v":72.576029516707308},null,null,null,null,null,null,{"$f":"+W113-AA38/2*V19","v":56.173970483292692}]
[]
[]
[null,"kiriş kolon yüzü moment (KNm)",null,null,null,null,null,{"$f":"+M105-(M112+H152)/2*G38/2","v":17.155940032441634},null,null,null,null,null,null,{"$f":"+M106-(O152+M113)/2*Q38/2","v":40.74402812972528},null,null,{"$f":"+W105-(W112+R152)/2*Q38/2","v":46.681051233800815},null,null,null,null,null,null,{"$f":"+W106-(Y152+W113)/2*AA38/2","v":25.146778739465503}]

{"sheet":"3_aciklikli","index":2,"n_rows":155,"n_cols":44,"rows_kept":155,"cut":false,"hidden":false,"merged":[[29,8,29,9],[29,14,29,15],[29,24,29,25],[29,34,29,35],[29,28,29,29],[29,18,29,19],[12,13,12,14],[12,18,12,19],[12,33,12,34],[11,16,13,16],[11,23,11,24],[11,26,13,26],[11,28,11,29],[20,24,20,25],[20,26,22,26],[20,28,20,29],[20,34,20,35],[11,8,11,9],[51,39,51,40],[25,28,25,29],[25,34,25,35],[24,38,24,39],[24,43,26,43],[33,40,33,41],[33,37,33,38],[154,34,156,36],[151,24,153,26],[151,27,153,29],[151,30,153,33],[151,34,153,36],[146,34,150,36],[141,24,145,26],[141,27,145,29],[141,30,145,33],[141,34,145,36],[154,30,156,33],[22,38,22,39],[154,1,156,6],[154,7,156,9],[154,10,156,13],[154,14,156,16],[154,17,156,19],[154,20,156,23],[146,24,150,26],[146,27,150,29],[146,30,150,33],[151,1,153,6],[151,7,153,9],[151,10,153,13],[151,14,153,16],[151,17,153,19],[151,20,153,23],[146,1,150,6],[146,7,150,9],[146,10,150,13],[146,14,150,16],[146,17,150,19],[146,20,150,23],[154,24,156,26],[154,27,156,29],[141,1,145,6],[141,7,145,9],[141,10,145,13],[141,14,145,16],[141,17,145,19],[141,20,145,23],[98,33,98,34],[98,39,98,40],[100,1,103,6],[100,7,103,16],[100,17,103,26],[100,27,103,36],[98,3,98,4],[98,9,98,10],[98,13,98,14],[98,19,98,20],[98,23,98,24],[98,29,98,30],[121,11,121,12],[125,11,125,12],[129,11,129,12],[133,11,133,12],[121,21,121,22],[125,21,125,22],[88,15,88,16],[88,25,88,26],[88,35,88,36],[89,5,89,6],[90,8,90,9],[90,18,90,19],[90,28,90,29],[85,33,85,34],[85,39,85,40],[86,3,86,4],[86,9,86,10],[86,13,86,14],[86,19,86,20],[86,23,86,24],[86,29,86,30],[86,33,86,34],[86,39,86,40],[83,7,83,8],[83,17,83,18],[83,27,83,28],[83,37,83,38],[85,3,85,4],[85,9,85,10],[85,13,85,14],[85,19,85,20],[85,23,85,24],[85,29,85,30],[76,3,76,4],[76,9,76,10],[76,13,76,14],[76,19,76,20],[76,23,76,24],[76,29,76,30],[76,33,76,34],[76,39,76,40],[64,11,64,12],[64,21,64,22],[64,31,64,32],[73,3,73,4],[73,9,73,10],[73,13,73,14],[73,19,73,20],[73,23,73,24],[73,29,73,30],[73,33,73,34],[73,39,73,40],[61,4,61,5],[61,8,61,9],[61,14,61,15],[61,18,61,19],[61,24,61,25],[61,28,61,29],[61,34,61,35],[61,38,61,39],[57,15,57,16],[58,5,58,6],[58,37,58,38],[60,4,60,5],[60,8,60,9],[60,14,60,15],[60,18,60,19],[60,24,60,25],[60,28,60,29],[60,34,60,35],[60,38,60,39],[55,17,55,18],[56,7,56,8],[56,25,56,26],[56,27,56,28],[56,35,56,36],[51,3,51,4],[51,9,51,10],[51,13,51,14],[51,19,51,20],[51,23,51,24],[51,29,51,30],[51,33,51,34],[45,14,47,14],[45,24,47,24],[45,34,47,34],[49,11,49,12],[49,21,49,22],[49,31,49,32],[42,11,42,12],[42,21,42,22],[42,31,42,32],[44,7,44,8],[44,17,44,18],[44,27,44,28],[39,28,40,28],[39,38,40,38],[37,6,37,7],[37,16,37,17],[37,26,37,27],[37,36,37,37],[35,3,35,4],[35,11,35,12],[35,21,35,22],[35,31,35,32],[35,38,35,39],[39,8,40,8],[39,18,40,18],[28,24,28,25],[28,26,29,26],[28,28,28,29],[28,34,28,35],[28,36,29,36],[28,38,28,39],[30,24,30,25],[30,28,30,29],[30,34,30,35],[29,38,29,39],[28,4,28,5],[28,6,29,6],[28,8,28,9],[28,14,28,15],[28,16,29,16],[28,18,28,19],[29,4,29,5],[30,8,30,9],[30,14,30,15],[30,18,30,19],[26,34,26,35],[26,38,26,39],[27,4,27,5],[27,8,27,9],[27,14,27,15],[27,18,27,19],[27,24,27,25],[27,28,27,29],[27,34,27,35],[27,38,27,39],[25,36,27,36],[25,38,25,39],[26,4,26,5],[26,8,26,9],[26,14,26,15],[26,18,26,19],[26,24,26,25],[26,28,26,29],[25,4,25,5],[25,6,27,6],[25,8,25,9],[23,38,23,39],[24,4,24,5],[24,8,24,9],[24,14,24,15],[24,18,24,19],[24,24,24,25],[24,28,24,29],[24,34,24,35],[23,4,23,5],[23,6,24,6],[23,8,23,9],[23,14,23,15],[23,16,24,16],[23,18,23,19],[23,24,23,25],[23,26,24,26],[23,28,23,29],[20,36,22,36],[22,34,22,35],[25,14,25,15],[25,16,27,16],[25,18,25,19],[25,24,25,25],[25,26,27,26],[23,34,23,35],[23,36,24,36],[21,18,21,19],[21,24,21,25],[21,28,21,29],[21,34,21,35],[20,16,22,16],[19,5,19,6],[19,7,19,8],[19,11,19,12],[19,15,19,16],[22,4,22,5],[22,8,22,9],[22,14,22,15],[21,4,21,5],[21,8,21,9],[21,14,21,15],[13,43,15,43],[12,3,12,4],[14,6,15,6],[14,8,14,9],[14,13,14,14],[14,16,15,16],[14,18,14,19],[14,23,14,24],[14,26,15,26],[14,28,14,29],[14,33,14,34],[14,36,15,36],[12,38,12,39],[13,3,13,4],[15,8,15,9],[15,13,15,14],[13,38,13,39],[14,3,14,4],[15,18,15,19],[15,23,15,24],[15,28,15,29],[15,33,15,34],[14,38,14,39],[11,6,13,6],[10,33,10,34],[8,38,8,39],[9,3,9,4],[10,3,10,4],[9,38,9,39],[10,38,10,39],[11,36,13,36],[12,8,12,9],[11,13,11,14],[11,18,11,19],[12,23,12,24],[12,28,12,29],[11,33,11,34],[9,28,9,29],[9,33,9,34],[9,36,10,36],[11,3,11,4],[13,8,13,9],[13,13,13,14],[13,18,13,19],[13,23,13,24],[13,28,13,29],[13,33,13,34],[11,38,11,39],[1,1,1,45],[2,13,2,14],[3,6,3,7],[3,16,3,17],[3,26,3,27],[3,36,3,37],[16,10,16,11],[16,20,16,21],[16,30,16,31],[5,38,6,38],[7,3,7,4],[9,6,10,6],[9,8,9,9],[9,13,9,14],[9,16,10,16],[9,18,9,19],[9,23,9,24],[9,26,10,26],[5,8,6,8],[5,18,6,18],[5,28,6,28],[7,38,7,39],[10,13,10,14],[10,18,10,19],[21,38,21,39],[20,18,20,19],[33,2,33,3],[33,5,33,6],[16,3,16,4],[16,6,18,6],[16,8,16,9],[16,13,16,14],[16,16,18,16],[16,18,16,19],[16,23,16,24],[16,26,18,26],[16,28,16,29],[16,33,16,34],[16,36,18,36],[18,2,18,3],[18,11,18,12],[18,21,18,22],[18,31,18,32],[18,39,18,40],[20,4,20,5],[20,6,22,6],[20,8,20,9],[20,14,20,15],[129,21,129,22],[133,21,133,22],[121,31,121,32],[125,31,125,32],[129,31,129,32],[133,31,133,32],[16,39,16,40],[33,8,33,9],[33,13,33,14],[33,18,33,19],[33,23,33,24],[33,28,33,29],[33,33,33,34],[19,25,19,26],[19,27,19,28],[19,31,19,32],[19,35,19,36],[19,37,19,38],[19,17,19,18],[19,21,19,22],[22,18,22,19],[22,24,22,25],[22,28,22,29],[20,38,20,39]]}
[]
[null,"SAPLAMA KİRİŞLİ ÇERÇEVE CROSS (3 AÇIKLIKLI)\n(inş.müh. Gürcan BERBEROĞLU tel: 0532 366 02 04   www.betoncelik.com )"]
[null,null,null,null,null,null,null,null,"pas payı  d ' =",null,null,null,null,0.03,null,"m",null,null,null,null,null,"dikkat sadece sarı hücrelere rakam giriniz."]
[null,null,null,null,null,null,0.35,null,"m",null,null,null,null,null,null,null,0.25,null,"m",null,null,null,null,null,null,null,0.25,null,"m",null,null,null,null,null,null,null,0.35,null,"m"]
[null,null,null,null,null,null,null,null,"m",null,null,null,null,null,null,null,null,null,"m",null,null,null,null,null,null,null,null,null,"m",null,null,null,null,null,null,null,null,null,"m"]
[null,null,null,null,null,null,null,null,0.25,null,null,null,null,null,null,null,null,null,0.35,null,null,null,null,null,null,null,null,null,0.35,null,null,null,null,null,null,null,null,null,0.25]
[]
[]
[]
[null,null,null,{"$f":"SUM(D11:E15)","v":-24.364573666627251},null,null,"dm4",null,null,null,null,null,null,null,null,null,"dm4",null,null,null,null,null,null,null,null,null,"dm4",null,null,null,null,null,null,null,null,null,"dm4",null,{"$f":"SUM(AM11:AN15)","v":4.4145222676505016}]
[null,null,null,{"$f":"-I29*G21","v":-7.1749810716935265E-3}]
[null,null,null,{"$f":"-I27*G21","v":-4.5916167323240269E-2},null,null,{"$f":"I6*G4^3/12*10000","v":8.9322916666666643},null,{"$f":"SUM(I13:J17)","v":-8.3570487676531453},null,null,null,null,{"$f":"SUM(N13:O17)","v":0.9686345098010356},null,null,{"$f":"S6*Q4^3/12*10000","v":4.5572916666666661},null,{"$f":"SUM(S13:T17)","v":0.75338239651191652},null,null,null,null,{"$f":"SUM(X13:Y17)","v":0.62375368747310467},null,null,{"$f":"AC6*AA4^3/12*10000","v":4.5572916666666661},null,{"$f":"SUM(AC13:AD17)","v":0.48514175692352579},null,null,null,null,{"$f":"SUM(AH13:AI17)","v":12.870327310934407},null,null,{"$f":"AM6*AK4^3/12*10000","v":8.9322916666666643},null,{"$f":"-AI28*AK17","v":6.9551733975543005E-3}]
[null,null,null,{"$f":"-I25*G21","v":-0.27445098979812965},null,null,null,null,{"$f":"-I29*G17","v":-2.4610185075908792E-3},null,null,null,null,null,null,null,null,null,null,null,null,null,null,{"$f":"-(Y29+AC29)*AA21","v":-2.3617070614440042E-3},null,null,null,null,{"$f":"-(Y29+AC29)*AA17","v":-1.8368832700120031E-3},null,null,null,null,null,null,null,null,null,{"$f":"-AI26*AK17","v":4.6192681000708516E-2},null,null,null,null,"m"]
[null,null,null,{"$f":"-I23*G21","v":-0.85695138620098732},null,null,null,null,{"$f":"-I27*G17","v":-1.5749245391871409E-2},null,null,null,null,{"$f":"-(O28+S28)*Q21","v":5.8674312101173656E-3},null,null,null,null,{"$f":"-(O28+S28)*Q17","v":4.5635576078690617E-3},null,null,null,null,{"$f":"-(Y27+AC27)*AA21","v":-1.5366295963029686E-2},null,null,null,null,{"$f":"-(Y27+AC27)*AA17","v":-1.1951563526800867E-2},null,null,null,null,{"$f":"-AI28*AK21","v":2.0277473462257438E-2},null,null,null,null,{"$f":"-AI24*AK17","v":0.34412096113405188},null,null,null,null,3]
[null,null,null,{"$f":"-(E21+I21)*G21","v":-23.180080142233201},null,null,"I =",null,{"$f":"-I25*G17","v":-9.4136689500758444E-2},null,null,null,null,{"$f":"-(O26+S26)*Q21","v":3.7548524589732707E-2},null,null,"I =",null,{"$f":"-(O26+S26)*Q17","v":2.9204408014236547E-2},null,null,null,null,{"$f":"-(Y25+AC25)*AA21","v":-0.10205502681389673},null,null,"I =",null,{"$f":"-(Y25+AC25)*AA17","v":-7.9376131966364116E-2},null,null,null,null,{"$f":"-AI26*AK21","v":0.13467253936066625},null,null,"I =",null,{"$f":"-(AI21+AM21+AI22)*AK17","v":4.0172534521181866}]
[null,null,null,null,null,null,null,null,{"$f":"-I23*G17","v":-0.2939343254669386},null,null,null,null,{"$f":"-(O24+S24)*Q21","v":0.22443575628960655},null,null,null,null,{"$f":"-(O24+S24)*Q17","v":0.17456114378080509},null,null,null,null,{"$f":"-(Y23+AC23)*AA21","v":-0.76027788720946754},null,null,null,null,{"$f":"-(Y23+AC23)*AA17","v":-0.59132724560736361},null,null,null,null,{"$f":"-AI24*AK21","v":1.0032681082625421}]
[null,null,null,12,null,"KN",{"$f":"(4*G12/AR14)/((4*G12/AR14)+(4*L20/L36)+(4*G26/AR25))","v":0.11485725351705171},null,{"$f":"-(E21+I21)*G17","v":-7.9507674887859867},null,25,null,"KN",{"$f":"-(O21+O22+S21+S22)*Q21","v":0.70078279771157892},null,null,{"$f":"(4*Q12/AR14)/((4*Q12/AR14)+(4*V20/V36)+(4*Q26/AR25)+(4*L20/L36))","v":4.4068129805730862E-2},null,{"$f":"-(O21+O22+S21+S22)*Q17","v":0.5450532871090058},null,15,null,"KN",{"$f":"-(Y21+AC21)*AA21","v":1.5038146045209426},null,null,{"$f":"(4*AA12/AR14)/((4*AA12/AR14)+(4*AA26/AR25)+(4*V20/V36)+(4*AF20/AF36))","v":4.0780656200166736E-2},null,{"$f":"-(Y21+AC21)*AA17","v":1.1696335812940664},null,25,null,"KN",{"$f":"-(AI21+AM21+AI22)*AK21","v":11.712109189848942},null,null,{"$f":"(4*AK12/AR14)/((4*AK12/AR14)+(4*AK26/AR25)+(4*AF20/AF36))","v":0.10373688906794168},null,null,12,null,"KN"]
[]
[null,"q =",10,null,"KN/m",null,null,null,null,null,"q =",44.29,null,"KN/m",null,null,null,null,null,null,"q =",40,null,"KN/m",null,null,null,null,null,null,"q =",44.29,null,"KN/m",null,null,null,null,"q =",10,null,"KN/m"]
[null,null,null,null,null,0,null,{"$f":"(4*L20/L36)/((4*G12/AR14)+(4*L20/L36)+(4*G26/AR25))","v":0.55028194905714156},null,null,"I =",{"$f":"(L43*H45^3/12+H45*L43*(((H45*L43*H45/2+L50*(O46-H45)*((O46-H45)/2+H45))/(L43*H45+(O46-H45)*L50))-H45/2)^2+L50*(O46-H45)^3/12+L50*(O46-H45)*(O46-((H45*L43*H45/2+L50*(O46-H45)*((O46-H45)/2+H45))/(L43*H45+(O46-H45)*L50))-(O46-H45)/2)^2)*10000","v":65.618502096872149},null,"dm4",null,{"$f":"(4*L20/L36)/((4*Q12/AR14)+(4*V20/V36)+(4*Q26/AR25)+(4*L20/L36))","v":0.41381624069665812},null,{"$f":"(4*V20/V36)/((4*Q12/AR14)+(4*V20/V36)+(4*Q26/AR25)+(4*L20/L36))","v":0.48545660546167135},null,null,"I =",{"$f":"(V43*R45^3/12+R45*V43*(((R45*V43*R45/2+V50*(Y46-R45)*((Y46-R45)/2+R45))/(V43*R45+(Y46-R45)*V50))-R45/2)^2+V50*(Y46-R45)^3/12+V50*(Y46-R45)*(Y46-((R45*V43*R45/2+V50*(Y46-R45)*((Y46-R45)/2+R45))/(V43*R45+(Y46-R45)*V50))-(Y46-R45)/2)^2)*10000","v":83.672234800664427},null,"dm4",null,{"$f":"(4*V20/V36)/((4*AA12/AR14)+(4*AA26/AR25)+(4*V20/V36)+(4*AF20/AF36))","v":0.44924164049407572},null,{"$f":"(4*AF20/AF36)/((4*AA12/AR14)+(4*AA26/AR25)+(4*V20/V36)+(4*AF20/AF36))","v":0.45754543104840045},null,null,"I =",{"$f":"(AF43*AB45^3/12+AB45*AF43*(((AB45*AF43*AB45/2+AF50*(AI46-AB45)*((AI46-AB45)/2+AB45))/(AF43*AB45+(AI46-AB45)*AF50))-AB45/2)^2+AF50*(AI46-AB45)^3/12+AF50*(AI46-AB45)*(AI46-((AB45*AF43*AB45/2+AF50*(AI46-AB45)*((AI46-AB45)/2+AB45))/(AF43*AB45+(AI46-AB45)*AF50))-(AI46-AB45)/2)^2)*10000","v":65.618502096872149},null,"dm4",null,{"$f":"(4*AF20/AF36)/((4*AK12/AR14)+(4*AK26/AR25)+(4*AF20/AF36))","v":0.59382320111298625},null,0]
[null,null,null,null,{"$f":"IF(OR(D36=0,D36=\"\"),0,-C19*D36*D36/2-D17*F34)","v":-23.25},null,{"$f":"(4*G26/AR25)/((4*G12/AR14)+(4*L20/L36)+(4*G26/AR25))","v":0.33486079742580682},null,{"$f":"L19*L36^2/12+K17*I34*N34^2/L36^2","v":92.473033333333319},null,null,null,null,null,{"$f":"-L19*L36^2/12-K17*N34*I34^2/L36^2","v":-92.473033333333319},null,{"$f":"(4*Q26/AR25)/((4*Q12/AR14)+(4*V20/V36)+(4*Q26/AR25)+(4*L20/L36))","v":5.6659024035939684E-2},null,{"$f":"V19*V36^2/12+U17*S34*X34^2/V36^2","v":92.708333333333329},null,null,null,null,null,{"$f":"-V19*V36^2/12-U17*X34*S34^2/V36^2","v":-92.708333333333329},null,{"$f":"(4*AA26/AR25)/((4*AA12/AR14)+(4*AA26/AR25)+(4*V20/V36)+(4*AF20/AF36))","v":5.2432272257357235E-2},null,{"$f":"AF19*AF36^2/12+AE17*AC34*AH34^2/AF36^2","v":64.027245526578412},null,null,null,null,null,{"$f":"-AF19*AF36^2/12-AE17*AH34*AC34^2/AF36^2","v":-68.536859289438922},null,{"$f":"(4*AK26/AR25)/((4*AK12/AR14)+(4*AK26/AR25)+(4*AF20/AF36))","v":0.30243990981907198},null,{"$f":"IF(OR(AM36=0,AM36=\"\"),0,AN19*AM36*AM36/2+AN17*AL34)","v":23.25}]
[null,null,null,null,null,null,null,null,{"$f":"-(E21+I21)*H20","v":-38.09218570231414},null,null,null,null,null,{"$f":"+I22/2","v":-19.04609285115707},null,null,null,{"$f":"+Y22/2","v":6.4423694687306057},null,null,null,null,null,{"$f":"-(Y21+AC21)*Z20","v":12.884738937461211},null,null,null,{"$f":"-(Y21+AC21)*AB20","v":13.122900683478701},null,null,null,null,null,{"$f":"+AC22/2","v":6.5614503417393504}]
[null,null,null,null,null,null,null,null,{"$f":"+O23/2","v":2.5591272337301803},null,null,null,null,null,{"$f":"-(O21+O22+S21+S22)*P20","v":5.1182544674603605},null,null,null,{"$f":"-(O21+O22+S21+S22)*R20","v":6.0043328301455103},null,null,null,null,null,{"$f":"+S23/2","v":3.0021664150727552},null,null,null,{"$f":"+AI23/2","v":11.498023152866219},null,null,null,null,null,{"$f":"-(AI21+AM21+AI22)*AJ20","v":22.996046305732438}]
[null,null,null,null,null,null,"dm4",null,{"$f":"-I23*H20","v":-1.4082415220622546},null,null,null,null,null,{"$f":"+I24/2","v":-0.70412076103112731},null,"dm4",null,{"$f":"+Y24/2","v":-3.2570444744879938},null,null,null,null,null,{"$f":"-(Y23+AC23)*Z20","v":-6.5140889489759877},null,"dm4",null,{"$f":"-(Y23+AC23)*AB20","v":-6.6344954861461574},null,null,null,null,null,{"$f":"+AC24/2","v":-3.3172477430730787},null,"dm4",null,null,null,null,null,null,"m"]
[null,null,null,null,null,null,null,null,{"$f":"+O25/2","v":0.81959725327040756},null,null,null,null,null,{"$f":"-(O24+S24)*P20","v":1.6391945065408151},null,null,null,{"$f":"-(O24+S24)*R20","v":1.9229738289078944},null,null,null,null,null,{"$f":"+S25/2","v":0.96148691445394718},null,null,null,{"$f":"+AI25/2","v":0.98492933683824224},null,null,null,null,null,{"$f":"-AI24*AJ20","v":1.9698586736764845},null,null,null,null,null,null,null,null,3]
[null,null,null,null,null,null,{"$f":"I40*G38^3/12*10000","v":26.041666666666664},null,{"$f":"-I25*H20","v":-0.45100957397151958},null,null,null,null,null,{"$f":"+I26/2","v":-0.22550478698575979},null,{"$f":"S40*Q38^3/12*10000","v":5.859375},null,{"$f":"+Y26/2","v":-0.43720561490741616},null,null,null,null,null,{"$f":"-(Y25+AC25)*Z20","v":-0.87441122981483232},null,{"$f":"AC40*AA38^3/12*10000","v":5.859375},null,{"$f":"-(Y25+AC25)*AB20","v":-0.8905738626970966},null,null,null,null,null,{"$f":"+AC26/2","v":-0.4452869313485483},null,{"$f":"AM40*AK38^3/12*10000","v":26.041666666666664}]
[null,null,null,null,null,null,null,null,{"$f":"+O27/2","v":0.13712016359100276},null,null,null,null,null,{"$f":"-(O26+S26)*P20","v":0.27424032718200553},null,null,null,{"$f":"-(O26+S26)*R20","v":0.3217171421072012},null,null,null,null,null,{"$f":"+S27/2","v":0.1608585710536006},null,null,null,{"$f":"+AI27/2","v":0.13221085549358674},null,null,null,null,null,{"$f":"-AI26*AJ20","v":0.26442171098717349}]
[null,null,null,null,null,null,null,null,{"$f":"-I27*H20","v":-7.5454750875891097E-2},null,null,null,null,null,{"$f":"+I28/2","v":-3.7727375437945548E-2},null,null,null,{"$f":"+Y28/2","v":-6.5829494980358241E-2},null,null,null,null,null,{"$f":"-(Y27+AC27)*Z20","v":-0.13165898996071648},null,null,null,{"$f":"-(Y27+AC27)*AB20","v":-0.13409257709664038},null,null,null,null,null,{"$f":"+AC28/2","v":-6.704628854832019E-2}]
[null,null,null,null,null,null,"I =",null,{"$f":"+O29/2","v":2.1426757407406717E-2},null,null,null,null,null,{"$f":"-(O28+S28)*P20","v":4.2853514814813434E-2},null,"I =",null,{"$f":"-(O28+S28)*R20","v":5.0272366785503925E-2},null,null,null,null,null,{"$f":"+S29/2","v":2.5136183392751962E-2},null,"I =",null,{"$f":"+AI29/2","v":1.9906820844254224E-2},null,null,null,null,null,{"$f":"-AI28*AJ20","v":3.9813641688508448E-2},null,"I ="]
[null,null,null,null,null,null,null,null,{"$f":"-I29*H20","v":-1.1790757828122314E-2},null,null,null,null,null,null,null,null,null,null,null,null,null,null,null,{"$f":"-(Y29+AC29)*Z20","v":-2.0235193116214266E-2},null,null,null,{"$f":"-(Y29+AC29)*AB20","v":-2.0609220789335924E-2}]
[null,null,null,null,null,null,null,null,{"$f":"SUM(I21:J30)","v":55.971622434280384},null,null,null,null,null,{"$f":"SUM(O21:P30)","v":-105.41193629194723},null,null,null,{"$f":"SUM(S21:T30)","v":103.68991938563428},null,null,null,null,null,{"$f":"SUM(Y21:Z30)","v":-83.214340673766827},null,null,null,{"$f":"SUM(AC21:AD30)","v":82.10544522937019},null,null,null,null,null,{"$f":"SUM(AI21:AJ30)","v":-40.534849578584911}]
[]
[]
[null,null,0.5,null,"m",{"$f":"+D36-C34","v":1},null,"m",2.2999999999999998,null,"m",null,null,{"$f":"+L36-I34","v":2.2999999999999998},null,"m",null,null,2.5,null,"m",null,null,{"$f":"+V36-S34","v":2.5},null,"m",null,null,2.2999999999999998,null,"m",null,null,{"$f":"+AF36-AC34","v":1.5500000000000003},null,"m",null,{"$f":"+AM36-AO34","v":1},null,"m",0.5,null,"m"]
[]
[null,null,null,1.5,null,"m",null,null,null,null,null,4.5999999999999996,null,"m",null,null,null,null,null,null,null,5,null,"m",null,null,null,null,null,null,null,3.85,null,"m",null,null,null,null,1.5,null,"m"]
[]
[null,null,null,null,null,null,0.5,null,"m",null,null,null,null,null,null,null,0.25,null,"m",null,null,null,null,null,null,null,0.25,null,"m",null,null,null,null,null,null,null,0.5,null,"m"]
[null,null,null,null,null,null,null,null,"m",null,null,null,null,null,null,null,null,null,"m",null,null,null,null,null,null,null,null,null,"m",null,null,null,null,null,null,null,null,null,"m"]
[null,null,null,null,null,null,null,null,0.25,null,null,null,null,null,null,null,null,null,0.45,null,null,null,null,null,null,null,null,null,0.45,null,null,null,null,null,null,null,null,null,0.25]
[]
[]
[null,null,null,null,null,null,null,null,null,null,null,0.61599999999999999,null,"m",null,null,null,null,null,null,null,1.18,null,"m",null,null,null,null,null,null,null,0.61599999999999999,null,"m"]
[]
[null,null,null,null,null,null,null,0.13,null,"m",null,null,null,null,"m",null,null,0.13,null,"m",null,null,null,null,"m",null,null,0.13,null,"m",null,null,null,null,"m"]
[null,null,null,null,null,null,null,null,null,null,null,null,null,null,0.6,null,null,null,null,null,null,null,null,null,0.6,null,null,null,null,null,null,null,null,null,0.6]
[]
[]
[]
[null,null,null,null,null,null,null,null,null,null,null,0.25,null,"m",null,null,null,null,null,null,null,0.25,null,"m",null,null,null,null,null,null,null,0.25,null,"m"]
[]
[null,null,null,{"$f":"IF(I12<0,I12/2,\"\")","v":-4.1785243838265727},null,null,null,null,null,{"$f":"IF(I12>0,I12/2,\"\")","v":""},null,null,null,{"$f":"IF(S12<0,S12/2,\"\")","v":""},null,null,null,null,null,{"$f":"IF(S12>0,S12/2,\"\")","v":0.37669119825595826},null,null,null,{"$f":"IF(AC12<0,AC12/2,\"\")","v":""},null,null,null,null,null,{"$f":"IF(AC12>0,AC12/2,\"\")","v":0.2425708784617629},null,null,null,{"$f":"IF(AM10<0,AM10/2,\"\")","v":""},null,null,null,null,null,{"$f":"IF(AM10>0,AM10/2,\"\")","v":2.2072611338252508}]
[]
[]
[null,null,null,null,null,null,null,null,null,"moment diyagramı (KNm)"]
[null,null,null,null,null,null,null,null,null,null,null,null,null,null,null,null,null,{"$f":"-S31","v":-103.68991938563428}]
[null,null,null,null,null,null,null,{"$f":"-I31","v":-55.971622434280384},null,null,null,null,null,null,null,null,null,null,null,null,null,null,null,null,null,{"$f":"Y31","v":-83.214340673766827},null,{"$f":"-AC31","v":-82.10544522937019},null,null,null,null,null,null,null,{"$f":"AI31","v":-40.534849578584911}]
[null,null,null,null,null,null,null,null,null,null,null,null,null,null,null,{"$f":"O31","v":-105.41193629194723}]
[null,null,null,null,null,{"$f":"IF(E21=0,\"\",+E21)","v":-23.25},null,null,null,null,null,null,null,null,null,null,null,null,null,null,null,null,null,null,null,null,null,null,null,null,null,null,null,null,null,null,null,{"$f":"IF(AM21=0,\"\",-AM21)","v":-23.25}]
[]
[null,null,null,null,{"$f":"IF(I12>0,-I12,\"\")","v":""},null,null,null,{"$f":"IF(I12<0,-I12,\"\")","v":8.3570487676531453},null,null,null,null,null,{"$f":"IF(S12>0,-S12,\"\")","v":-0.75338239651191652},null,null,null,{"$f":"IF(S12<0,-S12,\"\")","v":""},null,null,null,null,null,{"$f":"IF(AC12>0,-AC12,\"\")","v":-0.48514175692352579},null,null,null,{"$f":"IF(AC12<0,-AC12,\"\")","v":""},null,null,null,null,null,{"$f":"IF(AM10>0,-AM10,\"\")","v":-4.4145222676505016},null,null,null,{"$f":"IF(AM10<0,-AM10,\"\")","v":""}]
[null,null,null,null,{"$f":"IF(D10<0,D10,\"\")","v":-24.364573666627251},null,null,null,{"$f":"IF(D10>0,D10,\"\")","v":""},null,null,null,null,null,{"$f":"IF(N12<0,N12,\"\")","v":""},null,null,null,{"$f":"IF(N12>0,N12,\"\")","v":0.9686345098010356},null,null,null,null,null,{"$f":"IF(X12<0,X12,\"\")","v":""},null,null,null,{"$f":"IF(X12>0,X12,\"\")","v":0.62375368747310467},null,null,null,null,null,{"$f":"IF(AH12<0,AH12,\"\")","v":""},null,null,null,{"$f":"IF(AH12>0,AH12,\"\")","v":12.870327310934407}]
[]
[]
[null,null,null,null,null,null,null,null,null,null,null,{"$f":"+M116","v":65.205270636886155},null,null,null,null,null,null,null,null,null,{"$f":"+W116","v":50.297869970299445},null,null,null,null,null,null,null,null,null,{"$f":"+AG116","v":44.825212237332693}]
[]
[]
[]
[]
[]
[]
[]
[]
[null,null,null,{"$f":"IF(D10>0,-D10/2,\"\")","v":""},null,null,null,null,null,{"$f":"IF(D10<0,-D10/2,\"\")","v":12.182286833313626},null,null,null,{"$f":"IF(N12>0,-N12/2,\"\")","v":-0.4843172549005178},null,null,null,null,null,{"$f":"IF(N12<0,-N12/2,\"\")","v":""},null,null,null,{"$f":"IF(X12>0,-X12/2,\"\")","v":-0.31187684373655233},null,null,null,null,null,{"$f":"IF(X12<0,-X12/2,\"\")","v":""},null,null,null,{"$f":"IF(AH12>0,-AH12/2,\"\")","v":-6.4351636554672034},null,null,null,null,null,{"$f":"IF(AH12<0,-AH12/2,\"\")","v":""}]
[]
[]
[null,null,null,{"$f":"IF(I12<0,(I12+I12/2)/$AR$14,\"\")","v":-4.1785243838265727},null,null,null,null,null,{"$f":"IF(I12>0,(I12+I12/2)/$AR$14,\"\")","v":""},null,null,null,{"$f":"IF(S12<0,(S12+S12/2)/$AR$14,\"\")","v":""},null,null,null,null,null,{"$f":"IF(S12>0,(S12+S12/2)/$AR$14,\"\")","v":0.37669119825595826},null,null,null,{"$f":"IF(AC12<0,(AC12+AC12/2)/$AR$14,\"\")","v":""},null,null,null,null,null,{"$f":"IF(AC12>0,(AC12+AC12/2)/$AR$14,\"\")","v":0.24257087846176292},null,null,null,{"$f":"IF(AM10<0,(AM10+AM10/2)/$AR$14,\"\")","v":""},null,null,null,null,null,{"$f":"IF(AM10>0,(AM10+AM10/2)/$AR$14,\"\")","v":2.2072611338252508}]
[]
[]
[null,null,null,null,null,null,null,null,null,"kesme kuvveti diyagramı (KN)"]
[]
[]
[]
[null,null,null,null,null,null,null,{"$f":"+M112","v":103.61910568311589},null,null,null,null,null,null,null,null,null,{"$f":"+W112","v":111.59511574237349},null,null,null,null,null,null,null,null,null,{"$f":"+AG112","v":106.12074237682734},null,null,null,null,null,null,null,null,null,{"$f":"IF(AM21=0,\"\",AN19*AM36+AN17)","v":27}]
[]
[null,null,null,{"$f":"IF(D77<0,D77,\"\")","v":-4.1785243838265727},null,null,null,null,null,{"$f":"IF(J77>0,J77,\"\")","v":""},null,null,null,{"$f":"IF(N77<0,N77,\"\")","v":""},null,null,null,null,null,{"$f":"IF(T77>0,T77,\"\")","v":0.37669119825595826},null,null,null,{"$f":"IF(X77<0,X77,\"\")","v":""},null,null,null,null,null,{"$f":"IF(AD77>0,AD77,\"\")","v":0.24257087846176292},null,null,null,{"$f":"IF(AH77<0,AH77,\"\")","v":""},null,null,null,null,null,{"$f":"IF(AN77>0,AN77,\"\")","v":2.2072611338252508}]
[null,null,null,{"$f":"IF(D99<0,D99,\"\")","v":-12.182286833313626},null,null,null,null,null,{"$f":"IF(J99>0,J99,\"\")","v":""},null,null,null,{"$f":"IF(N99<0,N99,\"\")","v":""},null,null,null,null,null,{"$f":"IF(T99>0,T99,\"\")","v":0.48431725490051775},null,null,null,{"$f":"IF(X99<0,X99,\"\")","v":""},null,null,null,null,null,{"$f":"IF(AD99>0,AD99,\"\")","v":0.31187684373655233},null,null,null,{"$f":"IF(AH99<0,AH99,\"\")","v":""},null,null,null,null,null,{"$f":"IF(AN99>0,AN99,\"\")","v":6.4351636554672034}]
[]
[null,null,null,null,null,null,null,null,null,null,null,null,null,null,null,{"$f":"-M113","v":-125.11489431688409},null,null,null,null,null,null,null,null,null,{"$f":"-W113","v":-103.40488425762651},null,null,null,null,null,null,null,null,null,{"$f":"-AG113","v":-89.39575762317267}]
[null,null,null,null,null,{"$f":"IF(E21=0,\"\",-C19*D36-D17)","v":-27}]
[null,null,null,null,null,null,null,null,{"$f":"+M114","v":2.2999999999999998},null,"m",null,null,null,null,null,null,null,{"$f":"+W114","v":2.5},null,"m",null,null,null,null,null,null,null,{"$f":"+AG114","v":2.2999999999999998},null,"m"]
[]
[]
[]
[]
[]
[]
[]
[null,null,null,{"$f":"IF(D10<0,(D10+D10/2)/$AR$25,\"\")","v":-12.182286833313626},null,null,null,null,null,{"$f":"IF(D10>0,(D10+D10/2)/$AR$25,\"\")","v":""},null,null,null,{"$f":"IF(N12<0,(N12+N12/2)/$AR$25,\"\")","v":""},null,null,null,null,null,{"$f":"IF(N12>0,(N12+N12/2)/$AR$25,\"\")","v":0.48431725490051775},null,null,null,{"$f":"IF(X12<0,(X12+X12/2)/$AR$25,\"\")","v":""},null,null,null,null,null,{"$f":"IF(X12>0,(X12+X12/2)/$AR$25,\"\")","v":0.31187684373655233},null,null,null,{"$f":"IF(AH12<0,(AH12+AH12/2)/$AR$25,\"\")","v":""},null,null,null,null,null,{"$f":"IF(AH12>0,(AH12+AH12/2)/$AR$25,\"\")","v":6.4351636554672034}]
[]
[null,"kiriş faydalı yükseklik \nd = h - d'     (m)",null,null,null,null,null,{"$f":"O46-N3","v":0.56999999999999995},null,null,null,null,null,null,null,null,null,{"$f":"Y46-N3","v":0.56999999999999995},null,null,null,null,null,null,null,null,null,{"$f":"AI46-N3","v":0.56999999999999995}]
[]
[]
[]
[null,null,null,{"$f":"IF(OR(C19=0,C19=\"\",D36=0,D36=\"\"),0,IF(OR(D17=0,D17=\"\",C34=0,C34=\"\"),1,2))","v":2},null,null,null,null,null,null,null,"sol moment     M1=",{"$f":"+I31","v":55.971622434280384},{"$f":"IF(M110=0,0,IF(M117=\"durum 1\",1,IF(M117=\"durum 2\",2,IF(M117=\"durum 3\",3))))","v":2},null,null,null,null,null,null,null,"sol moment     M1=",{"$f":"+S31","v":103.68991938563428},{"$f":"IF(W110=0,0,IF(W117=\"durum 1\",1,IF(W117=\"durum 2\",2,IF(W117=\"durum 3\",3))))","v":2},null,null,null,null,null,null,null,"sol moment     M1=",{"$f":"+AC31","v":82.10544522937019},{"$f":"IF(AG110=0,0,IF(AG117=\"durum 1\",1,IF(AG117=\"durum 2\",2,IF(AG117=\"durum 3\",3))))","v":2},null,null,null,null,null,null,{"$f":"IF(OR(AM36=0,AM36=\"\",AN19=0,AN19=\"\"),0,IF(OR(AN17=0,AN17=\"\",AO34=0,AO34=\"\"),1,2))","v":2}]
[null,null,null,null,null,null,null,null,null,null,null,"sağ moment     M2=",{"$f":"-O31","v":105.41193629194723},null,null,null,null,null,null,null,null,"sağ moment     M2=",{"$f":"-Y31","v":83.214340673766827},null,null,null,null,null,null,null,null,"sağ moment     M2=",{"$f":"-AI31","v":40.534849578584911}]
[null,null,null,null,null,null,null,null,null,null,null,"tekil yük        K=",{"$f":"+K17","v":25},null,null,null,null,null,null,null,null,"tekil yük        K=",{"$f":"+U17","v":15},null,null,null,null,null,null,null,null,"tekil yük        K=",{"$f":"+AE17","v":25}]
[null,null,null,null,null,null,null,null,null,null,null,"yayılı yük      Pd=",{"$f":"+L19","v":44.29},null,null,null,null,null,null,null,null,"yayılı yük      Pd=",{"$f":"+V19","v":40},null,null,null,null,null,null,null,null,"yayılı yük      Pd=",{"$f":"+AF19","v":44.29}]
[null,null,null,null,null,null,null,null,null,null,null,"L=",{"$f":"+L36","v":4.5999999999999996},null,null,null,null,null,null,null,null,"L=",{"$f":"+V36","v":5},null,null,null,null,null,null,null,null,"L=",{"$f":"+AF36","v":3.85}]
[null,null,null,null,null,null,null,null,null,null,null,"(K=0 ise a=0 alınacak)     a=",{"$f":"IF(OR(K17=0,K17=\"\",I34=0,I34=\"\"),0,I34)","v":2.2999999999999998},null,null,null,null,null,null,null,null,"(K=0 ise a=0 alınacak)     a=",{"$f":"IF(OR(U17=0,U17=\"\",S34=0,S34=\"\"),0,S34)","v":2.5},null,null,null,null,null,null,null,null,"(K=0 ise a=0 alınacak)     a=",{"$f":"IF(OR(AE17=0,AE17=\"\",AC34=0,AC34=\"\"),0,AC34)","v":2.2999999999999998}]
[null,null,null,null,null,null,null,null,null,null,null,"b=",{"$f":"M109-M110","v":2.2999999999999998},null,null,null,null,null,null,null,null,"b=",{"$f":"W109-W110","v":2.5},null,null,null,null,null,null,null,null,"b=",{"$f":"AG109-AG110","v":1.5500000000000003}]
[null,null,null,null,null,null,null,null,null,null,null,"(sol eksen kesme kuvveti)  A=",{"$f":"IF(M107>0,M108*M109+M107-M113,M108*M109-M113)","v":103.61910568311589},null,null,null,null,null,null,null,null,"(sol eksen kesme kuvveti)  A=",{"$f":"IF(W107>0,W108*W109+W107-W113,W108*W109-W113)","v":111.59511574237349},null,null,null,null,null,null,null,null,"(sol eksen kesme kuvveti)  A=",{"$f":"IF(AG107>0,AG108*AG109+AG107-AG113,AG108*AG109-AG113)","v":106.12074237682734}]
[null,null,null,null,null,null,null,null,null,null,null,"(sağ eksen kesme kuvveti)  B=",{"$f":"IF(M107>0,(M108*M109^2*0.5+M107*M110+M106-M105)/M109,(0.5*M108*M109^2+M106-M105)/M109)","v":125.11489431688409},null,null,null,null,null,null,null,null,"(sağ eksen kesme kuvveti)  B=",{"$f":"IF(W107>0,(W108*W109^2*0.5+W107*W110+W106-W105)/W109,(0.5*W108*W109^2+W106-W105)/W109)","v":103.40488425762651},null,null,null,null,null,null,null,null,"(sağ eksen kesme kuvveti)  B=",{"$f":"IF(AG107>0,(AG108*AG109^2*0.5+AG107*AG110+AG106-AG105)/AG109,(0.5*AG108*AG109^2+AG106-AG105)/AG109)","v":89.39575762317267}]
[null,null,null,null,null,null,null,null,null,null,null,"(max mom yeri A'dan mesafesi)  x=",{"$f":"IF(M108*M110>M112,(M112*M110)/(M110*M108),IF(AND(M108*M110<M112,M107>M112-M108*M110),M110,IF(AND(M108*M110<M112,M107<M112-M108*M110),((M109-M110)*(M112-M108*M110-M107)/(M112-M108*M110-M107+M113))+M110,\"HATALI\")))","v":2.2999999999999998},null,null,null,null,null,null,null,null,"(max mom yeri A'dan mesafesi)  x=",{"$f":"IF(W108*W110>W112,(W112*W110)/(W110*W108),IF(AND(W108*W110<W112,W107>W112-W108*W110),W110,IF(AND(W108*W110<W112,W107<W112-W108*W110),((W109-W110)*(W112-W108*W110-W107)/(W112-W108*W110-W107+W113))+W110,\"HATALI\")))","v":2.5},null,null,null,null,null,null,null,null,"(max mom yeri A'dan mesafesi)  x=",{"$f":"IF(AG108*AG110>AG112,(AG112*AG110)/(AG110*AG108),IF(AND(AG108*AG110<AG112,AG107>AG112-AG108*AG110),AG110,IF(AND(AG108*AG110<AG112,AG107<AG112-AG108*AG110),((AG109-AG110)*(AG112-AG108*AG110-AG107)/(AG112-AG108*AG110-AG107+AG113))+AG110,\"HATALI\")))","v":2.2999999999999998}]
[null,null,null,null,null,null,null,null,null,null,null,"açıklık momenti  Mmax=",{"$f":"IF(M108*M110>M112,(M112*M114/2)-M105,IF(AND(M108*M110<M112,M107>M112-M108*M110),(((M112+M112-M110*M108)/2)*M110)-M105,IF(AND(M108*M110<M112,M107<M112-M108*M110),(((M109-M110)*(M112-M108*M110-M107)/(M112-M108*M110-M107+M113))*(M112-M110*M108-M107)/2+(M112+M112-M110*M108)*M110/2)-M105,\"HATALI\")))","v":65.205270636886155},null,null,null,null,null,null,null,null,"açıklık momenti  Mmax=",{"$f":"IF(W108*W110>W112,(W112*W114/2)-W105,IF(AND(W108*W110<W112,W107>W112-W108*W110),(((W112+W112-W110*W108)/2)*W110)-W105,IF(AND(W108*W110<W112,W107<W112-W108*W110),(((W109-W110)*(W112-W108*W110-W107)/(W112-W108*W110-W107+W113))*(W112-W110*W108-W107)/2+(W112+W112-W110*W108)*W110/2)-W105,\"HATALI\")))","v":50.297869970299445},null,null,null,null,null,null,null,null,"açıklık momenti  Mmax=",{"$f":"IF(AG108*AG110>AG112,(AG112*AG114/2)-AG105,IF(AND(AG108*AG110<AG112,AG107>AG112-AG108*AG110),(((AG112+AG112-AG110*AG108)/2)*AG110)-AG105,IF(AND(AG108*AG110<AG112,AG107<AG112-AG108*AG110),(((AG109-AG110)*(AG112-AG108*AG110-AG107)/(AG112-AG108*AG110-AG107+AG113))*(AG112-AG110*AG108-AG107)/2+(AG112+AG112-AG110*AG108)*AG110/2)-AG105,\"HATALI\")))","v":44.825212237332693}]
[null,null,null,null,null,null,null,null,null,null,null,"x'den bağımsız hesap        Mmax=",{"$f":"IF(M108*M110>M112,(M112*(IF(M108*M110>M112,(M112*M110)/(M110*M108),IF(AND(M108*M110<M112,M107>M112-M108*M110),M110,IF(AND(M108*M110<M112,M107<M112-M108*M110),((M109-M110)*(M112-M108*M110-M107)/(M112-M108*M110-M107+M113))+M110,\"HATALI\"))))/2)-M105,IF(AND(M108*M110<M112,M107>M112-M108*M110),(((M112+M112-M110*M108)/2)*M110)-M105,IF(AND(M108*M110<M112,M107<M112-M108*M110),(((M109-M110)*(M112-M108*M110-M107)/(M112-M108*M110-M107+M113))*(M112-M110*M108-M107)/2+(M112+M112-M110*M108)*M110/2)-M105,\"HATALI\")))","v":65.205270636886155},null,null,null,null,null,null,null,null,"x'den bağımsız hesap        Mmax=",{"$f":"IF(W108*W110>W112,(W112*(IF(W108*W110>W112,(W112*W110)/(W110*W108),IF(AND(W108*W110<W112,W107>W112-W108*W110),W110,IF(AND(W108*W110<W112,W107<W112-W108*W110),((W109-W110)*(W112-W108*W110-W107)/(W112-W108*W110-W107+W113))+W110,\"HATALI\"))))/2)-W105,IF(AND(W108*W110<W112,W107>W112-W108*W110),(((W112+W112-W110*W108)/2)*W110)-W105,IF(AND(W108*W110<W112,W107<W112-W108*W110),(((W109-W110)*(W112-W108*W110-W107)/(W112-W108*W110-W107+W113))*(W112-W110*W108-W107)/2+(W112+W112-W110*W108)*W110/2)-W105,\"HATALI\")))","v":50.297869970299445},null,null,null,null,null,null,null,null,"x'den bağımsız hesap        Mmax=",{"$f":"IF(AG108*AG110>AG112,(AG112*(IF(AG108*AG110>AG112,(AG112*AG110)/(AG110*AG108),IF(AND(AG108*AG110<AG112,AG107>AG112-AG108*AG110),AG110,IF(AND(AG108*AG110<AG112,AG107<AG112-AG108*AG110),((AG109-AG110)*(AG112-AG108*AG110-AG107)/(AG112-AG108*AG110-AG107+AG113))+AG110,\"HATALI\"))))/2)-AG105,IF(AND(AG108*AG110<AG112,AG107>AG112-AG108*AG110),(((AG112+AG112-AG110*AG108)/2)*AG110)-AG105,IF(AND(AG108*AG110<AG112,AG107<AG112-AG108*AG110),(((AG109-AG110)*(AG112-AG108*AG110-AG107)/(AG112-AG108*AG110-AG107+AG113))*(AG112-AG110*AG108-AG107)/2+(AG112+AG112-AG110*AG108)*AG110/2)-AG105,\"HATALI\")))","v":44.825212237332693}]
[null,null,null,null,null,null,null,null,null,null,null,"durum",{"$f":"IF(M108*M110>M112,\"durum 1\",IF(AND(M108*M110<M112,M107>M112-M108*M110),\"durum 2\",IF(AND(M108*M110<M112,M107<M112-M108*M110),\"durum 3\",\"HATALI\")))","v":"durum 2"},null,null,null,null,null,null,null,null,"durum",{"$f":"IF(W108*W110>W112,\"durum 1\",IF(AND(W108*W110<W112,W107>W112-W108*W110),\"durum 2\",IF(AND(W108*W110<W112,W107<W112-W108*W110),\"durum 3\",\"HATALI\")))","v":"durum 2"},null,null,null,null,null,null,null,null,"durum",{"$f":"IF(AG108*AG110>AG112,\"durum 1\",IF(AND(AG108*AG110<AG112,AG107>AG112-AG108*AG110),\"durum 2\",IF(AND(AG108*AG110<AG112,AG107<AG112-AG108*AG110),\"durum 3\",\"HATALI\")))","v":"durum 2"}]
[null,null,null,null,null,null,null,null,null,null,null,"sol mesnet (kolon genişliği) s1=",{"$f":"+G38","v":0.5},null,null,null,null,null,null,null,null,"sol mesnet (kolon genişliği) s1=",{"$f":"+Q38","v":0.25},null,null,null,null,null,null,null,null,"sol mesnet (kolon genişliği) s1=",{"$f":"+AA38","v":0.25}]
[null,null,null,null,null,null,null,null,null,null,null,"sağ mesnet (kolon genişliği) s2=",{"$f":"+Q38","v":0.25},null,null,null,null,null,null,null,null,"sağ mesnet (kolon genişliği) s2=",{"$f":"+AA38","v":0.25},null,null,null,null,null,null,null,null,"sağ mesnet (kolon genişliği) s2=",{"$f":"+AK38","v":0.5}]
[null,null,null,null,null,null,null,null,null,null,null,"kiriş d yüksekliği=",{"$f":"+H101","v":0.56999999999999995},null,null,null,null,null,null,null,null,"kiriş d yüksekliği=",{"$f":"+R101","v":0.56999999999999995},null,null,null,null,null,null,null,null,"kiriş d yüksekliği=",{"$f":"+AB101","v":0.56999999999999995}]
[null,null,null,null,null,null,null,null,null,null,null,"kiriş h yüksekliği=",{"$f":"+O46","v":0.6},null,null,null,null,null,null,null,null,"kiriş h yüksekliği=",{"$f":"+Y46","v":0.6},null,null,null,null,null,null,null,null,"kiriş h yüksekliği=",{"$f":"+AI46","v":0.6}]
[null,null,null,null,null,null,null,null,null,null,null,"sol kolon yüzünden d mesafede kesme kuvveti",null,null,null,null,null,null,null,null,null,"sol kolon yüzünden d mesafede kesme kuvveti",null,null,null,null,null,null,null,null,null,"sol kolon yüzünden d mesafede kesme kuvveti"]
[null,null,null,null,null,null,null,null,null,null,null,"durum 1 için",{"$f":"IF(M114>(M120+M118/2),M112-M108*(M118/2+M120),IF(AND(M114<(M120+M118/2),(M120+M118/2)<M110),M108*(M120+M118/2)-M112,IF((M120+M118/2)=M110,M113-M108*M111,M108*M110-M112+M107+(M120+M118/2-M110)*M108)))","v":67.301305683115885},null,null,null,null,null,null,null,null,"durum 1 için",{"$f":"IF(W114>(W120+W118/2),W112-W108*(W118/2+W120),IF(AND(W114<(W120+W118/2),(W120+W118/2)<W110),W108*(W120+W118/2)-W112,IF((W120+W118/2)=W110,W113-W108*W111,W108*W110-W112+W107+(W120+W118/2-W110)*W108)))","v":83.795115742373497},null,null,null,null,null,null,null,null,"durum 1 için",{"$f":"IF(AG114>(AG120+AG118/2),AG112-AG108*(AG118/2+AG120),IF(AND(AG114<(AG120+AG118/2),(AG120+AG118/2)<AG110),AG108*(AG120+AG118/2)-AG112,IF((AG120+AG118/2)=AG110,AG113-AG108*AG111,AG108*AG110-AG112+AG107+(AG120+AG118/2-AG110)*AG108)))","v":75.339192376827341}]
[null,null,null,null,null,null,null,null,null,null,null,"durum 2 için",{"$f":"IF(M120+M118/2<M110,M112-(M120+M118/2)*M108,IF((M118/2+M120)=M110,M112-M108*M110,IF(M120+M118/2>M110,M107-M112+M108*M110+(M120+M118/2-M110)*M108,0)))","v":67.301305683115885},null,null,null,null,null,null,null,null,"durum 2 için",{"$f":"IF(W120+W118/2<W110,W112-(W120+W118/2)*W108,IF((W118/2+W120)=W110,W112-W108*W110,IF(W120+W118/2>W110,W107-W112+W108*W110+(W120+W118/2-W110)*W108,0)))","v":83.795115742373497},null,null,null,null,null,null,null,null,"durum 2 için",{"$f":"IF(AG120+AG118/2<AG110,AG112-(AG120+AG118/2)*AG108,IF((AG118/2+AG120)=AG110,AG112-AG108*AG110,IF(AG120+AG118/2>AG110,AG107-AG112+AG108*AG110+(AG120+AG118/2-AG110)*AG108,0)))","v":75.339192376827341}]
[null,null,null,null,null,null,null,null,null,null,null,"durum 3 için",{"$f":"IF((M120+M118/2)<M110,M112-(M120+M118/2)*M108,IF(AND(M110<(M120+M118/2),(M120+M118/2)<M114),M112-M108*M110-M107-(M120+M118/2-M110)*M108,IF((M120+M118/2)>M114,(M120+M118/2-M114)*M108,IF((M120+M118/2)=M110,M112-M108*M110,0))))","v":67.301305683115885},null,null,null,null,null,null,null,null,"durum 3 için",{"$f":"IF((W120+W118/2)<W110,W112-(W120+W118/2)*W108,IF(AND(W110<(W120+W118/2),(W120+W118/2)<W114),W112-W108*W110-W107-(W120+W118/2-W110)*W108,IF((W120+W118/2)>W114,(W120+W118/2-W114)*W108,IF((W120+W118/2)=W110,W112-W108*W110,0))))","v":83.795115742373497},null,null,null,null,null,null,null,null,"durum 3 için",{"$f":"IF((AG120+AG118/2)<AG110,AG112-(AG120+AG118/2)*AG108,IF(AND(AG110<(AG120+AG118/2),(AG120+AG118/2)<AG114),AG112-AG108*AG110-AG107-(AG120+AG118/2-AG110)*AG108,IF((AG120+AG118/2)>AG114,(AG120+AG118/2-AG114)*AG108,IF((AG120+AG118/2)=AG110,AG112-AG108*AG110,0))))","v":75.339192376827341}]
[null,null,null,null,null,null,null,null,null,null,null,"sağ kolon yüzünden d mesafede kesme kuvveti",null,null,null,null,null,null,null,null,null,"sağ kolon yüzünden d mesafede kesme kuvveti",null,null,null,null,null,null,null,null,null,"sağ kolon yüzünden d mesafede kesme kuvveti"]
[null,null,null,null,null,null,null,null,null,null,null,"durum 1 için",{"$f":"IF((M120+M119/2)<M111,M113-(M120+M119/2)*M108,IF(AND((M120+M119/2)>M111,(M120+M119/2)<(M109-M114)),M113-M111*M108-M107-(M120+M119/2-M111)*M108,IF((M120+M119/2)=(M109-M110),M107+M108*M110-M112,((M120+M119/2)-(M109-M114))*M108)))","v":94.333344316884094},null,null,null,null,null,null,null,null,"durum 1 için",{"$f":"IF((W120+W119/2)<W111,W113-(W120+W119/2)*W108,IF(AND((W120+W119/2)>W111,(W120+W119/2)<(W109-W114)),W113-W111*W108-W107-(W120+W119/2-W111)*W108,IF((W120+W119/2)=(W109-W110),W107+W108*W110-W112,((W120+W119/2)-(W109-W114))*W108)))","v":75.604884257626509},null,null,null,null,null,null,null,null,"durum 1 için",{"$f":"IF((AG120+AG119/2)<AG111,AG113-(AG120+AG119/2)*AG108,IF(AND((AG120+AG119/2)>AG111,(AG120+AG119/2)<(AG109-AG114)),AG113-AG111*AG108-AG107-(AG120+AG119/2-AG111)*AG108,IF((AG120+AG119/2)=(AG109-AG110),AG107+AG108*AG110-AG112,((AG120+AG119/2)-(AG109-AG114))*AG108)))","v":53.077957623172672}]
[null,null,null,null,null,null,null,null,null,null,null,"durum 2 için",{"$f":"IF((M120+M119/2)<M111,M113-(M120+M119/2)*M108,IF((M120+M119/2)=M111,M107-M112+M108*M110,IF((M120+M119/2)>M111,M112-(M109-(M120+M119/2))*M108,0)))","v":94.333344316884094},null,null,null,null,null,null,null,null,"durum 2 için",{"$f":"IF((W120+W119/2)<W111,W113-(W120+W119/2)*W108,IF((W120+W119/2)=W111,W107-W112+W108*W110,IF((W120+W119/2)>W111,W112-(W109-(W120+W119/2))*W108,0)))","v":75.604884257626509},null,null,null,null,null,null,null,null,"durum 2 için",{"$f":"IF((AG120+AG119/2)<AG111,AG113-(AG120+AG119/2)*AG108,IF((AG120+AG119/2)=AG111,AG107-AG112+AG108*AG110,IF((AG120+AG119/2)>AG111,AG112-(AG109-(AG120+AG119/2))*AG108,0)))","v":53.077957623172672}]
[null,null,null,null,null,null,null,null,null,null,null,"durum 3 için",{"$f":"IF((M109-M114)>(M120+M119/2),M113-(M120+M119/2)*M108,IF(AND((M120+M119/2)>(M109-M114),(M109-M110)>(M120+M119/2)),((M120+M119/2)-(M109-M114))*M108,IF(M120+M119/2>(M109-M110),M112-(M109-(M120+M119/2))*M108,IF((M120+M119/2)=(M109-M110),M112-M108*M110-M107,0))))","v":94.333344316884094},null,null,null,null,null,null,null,null,"durum 3 için",{"$f":"IF((W109-W114)>(W120+W119/2),W113-(W120+W119/2)*W108,IF(AND((W120+W119/2)>(W109-W114),(W109-W110)>(W120+W119/2)),((W120+W119/2)-(W109-W114))*W108,IF(W120+W119/2>(W109-W110),W112-(W109-(W120+W119/2))*W108,IF((W120+W119/2)=(W109-W110),W112-W108*W110-W107,0))))","v":75.604884257626509},null,null,null,null,null,null,null,null,"durum 3 için",{"$f":"IF((AG109-AG114)>(AG120+AG119/2),AG113-(AG120+AG119/2)*AG108,IF(AND((AG120+AG119/2)>(AG109-AG114),(AG109-AG110)>(AG120+AG119/2)),((AG120+AG119/2)-(AG109-AG114))*AG108,IF(AG120+AG119/2>(AG109-AG110),AG112-(AG109-(AG120+AG119/2))*AG108,IF((AG120+AG119/2)=(AG109-AG110),AG112-AG108*AG110-AG107,0))))","v":53.077957623172672}]
[null,null,null,null,null,null,null,null,null,null,null,"sol kolon yüzünden 2h mesafede kesme kuvveti",null,null,null,null,null,null,null,null,null,"sol kolon yüzünden 2h mesafede kesme kuvveti",null,null,null,null,null,null,null,null,null,"sol kolon yüzünden 2h mesafede kesme kuvveti"]
[null,null,null,null,null,null,null,null,null,null,null,"durum 1 için",{"$f":"IF(M114>(M121*2+M118/2),M112-M108*(M118/2+M121*2),IF(AND(M114<(M121*2+M118/2),(M121*2+M118/2)<M110),M108*(M121*2+M118/2)-M112,IF((M121*2+M118/2)=M110,M113-M108*M111,M108*M110-M112+M107+(M121*2+M118/2-M110)*M108)))","v":39.398605683115889},null,null,null,null,null,null,null,null,"durum 1 için",{"$f":"IF(W114>(W121*2+W118/2),W112-W108*(W118/2+W121*2),IF(AND(W114<(W121*2+W118/2),(W121*2+W118/2)<W110),W108*(W121*2+W118/2)-W112,IF((W121*2+W118/2)=W110,W113-W108*W111,W108*W110-W112+W107+(W121*2+W118/2-W110)*W108)))","v":58.595115742373494},null,null,null,null,null,null,null,null,"durum 1 için",{"$f":"IF(AG114>(AG121*2+AG118/2),AG112-AG108*(AG118/2+AG121*2),IF(AND(AG114<(AG121*2+AG118/2),(AG121*2+AG118/2)<AG110),AG108*(AG121*2+AG118/2)-AG112,IF((AG121*2+AG118/2)=AG110,AG113-AG108*AG111,AG108*AG110-AG112+AG107+(AG121*2+AG118/2-AG110)*AG108)))","v":47.436492376827339}]
[null,null,null,null,null,null,null,null,null,null,null,"durum 2 için",{"$f":"IF(M121*2+M118/2<M110,M112-(M121*2+M118/2)*M108,IF((M118/2+M121*2)=M110,M112-M108*M110,IF(M121*2+M118/2>M110,M107-M112+M108*M110+(M121*2+M118/2-M110)*M108,0)))","v":39.398605683115889},null,null,null,null,null,null,null,null,"durum 2 için",{"$f":"IF(W121*2+W118/2<W110,W112-(W121*2+W118/2)*W108,IF((W118/2+W121*2)=W110,W112-W108*W110,IF(W121*2+W118/2>W110,W107-W112+W108*W110+(W121*2+W118/2-W110)*W108,0)))","v":58.595115742373494},null,null,null,null,null,null,null,null,"durum 2 için",{"$f":"IF(AG121*2+AG118/2<AG110,AG112-(AG121*2+AG118/2)*AG108,IF((AG118/2+AG121*2)=AG110,AG112-AG108*AG110,IF(AG121*2+AG118/2>AG110,AG107-AG112+AG108*AG110+(AG121*2+AG118/2-AG110)*AG108,0)))","v":47.436492376827339}]
[null,null,null,null,null,null,null,null,null,null,null,"durum 3 için",{"$f":"IF((M121*2+M118/2)<M110,M112-(M121*2+M118/2)*M108,IF(AND(M110<(M121*2+M118/2),(M121*2+M118/2)<M114),M112-M108*M110-M107-(M121*2+M118/2-M110)*M108,IF((M121*2+M118/2)>M114,(M121*2+M118/2-M114)*M108,IF((M121*2+M118/2)=M110,M112-M108*M110,0))))","v":39.398605683115889},null,null,null,null,null,null,null,null,"durum 3 için",{"$f":"IF((W121*2+W118/2)<W110,W112-(W121*2+W118/2)*W108,IF(AND(W110<(W121*2+W118/2),(W121*2+W118/2)<W114),W112-W108*W110-W107-(W121*2+W118/2-W110)*W108,IF((W121*2+W118/2)>W114,(W121*2+W118/2-W114)*W108,IF((W121*2+W118/2)=W110,W112-W108*W110,0))))","v":58.595115742373494},null,null,null,null,null,null,null,null,"durum 3 için",{"$f":"IF((AG121*2+AG118/2)<AG110,AG112-(AG121*2+AG118/2)*AG108,IF(AND(AG110<(AG121*2+AG118/2),(AG121*2+AG118/2)<AG114),AG112-AG108*AG110-AG107-(AG121*2+AG118/2-AG110)*AG108,IF((AG121*2+AG118/2)>AG114,(AG121*2+AG118/2-AG114)*AG108,IF((AG121*2+AG118/2)=AG110,AG112-AG108*AG110,0))))","v":47.436492376827339}]
[null,null,null,null,null,null,null,null,null,null,null,"sağ kolon yüzünden 2h mesafede kesme kuvveti",null,null,null,null,null,null,null,null,null,"sağ kolon yüzünden 2h mesafede kesme kuvveti",null,null,null,null,null,null,null,null,null,"sağ kolon yüzünden 2h mesafede kesme kuvveti"]
[null,null,null,null,null,null,null,null,null,null,null,"durum 1 için",{"$f":"IF((M121*2+M119/2)<M111,M113-(M121*2+M119/2)*M108,IF(AND((M121*2+M119/2)>M111,(M121*2+M119/2)<(M109-M114)),M113-M111*M108-M107-(M121*2+M119/2-M111)*M108,IF((M121*2+M119/2)=(M109-M110),M107+M108*M110-M112,((M121*2+M119/2)-(M109-M114))*M108)))","v":66.430644316884099},null,null,null,null,null,null,null,null,"durum 1 için",{"$f":"IF((W121*2+W119/2)<W111,W113-(W121*2+W119/2)*W108,IF(AND((W121*2+W119/2)>W111,(W121*2+W119/2)<(W109-W114)),W113-W111*W108-W107-(W121*2+W119/2-W111)*W108,IF((W121*2+W119/2)=(W109-W110),W107+W108*W110-W112,((W121*2+W119/2)-(W109-W114))*W108)))","v":50.404884257626506},null,null,null,null,null,null,null,null,"durum 1 için",{"$f":"IF((AG121*2+AG119/2)<AG111,AG113-(AG121*2+AG119/2)*AG108,IF(AND((AG121*2+AG119/2)>AG111,(AG121*2+AG119/2)<(AG109-AG114)),AG113-AG111*AG108-AG107-(AG121*2+AG119/2-AG111)*AG108,IF((AG121*2+AG119/2)=(AG109-AG110),AG107+AG108*AG110-AG112,((AG121*2+AG119/2)-(AG109-AG114))*AG108)))","v":25.175257623172669}]
[null,null,null,null,null,null,null,null,null,null,null,"durum 2 için",{"$f":"IF((M121*2+M119/2)<M111,M113-(M121*2+M119/2)*M108,IF((M121*2+M119/2)=M111,M107-M112+M108*M110,IF((M121*2+M119/2)>M111,M112-(M109-(M121*2+M119/2))*M108,0)))","v":66.430644316884099},null,null,null,null,null,null,null,null,"durum 2 için",{"$f":"IF((W121*2+W119/2)<W111,W113-(W121*2+W119/2)*W108,IF((W121*2+W119/2)=W111,W107-W112+W108*W110,IF((W121*2+W119/2)>W111,W112-(W109-(W121*2+W119/2))*W108,0)))","v":50.404884257626506},null,null,null,null,null,null,null,null,"durum 2 için",{"$f":"IF((AG121*2+AG119/2)<AG111,AG113-(AG121*2+AG119/2)*AG108,IF((AG121*2+AG119/2)=AG111,AG107-AG112+AG108*AG110,IF((AG121*2+AG119/2)>AG111,AG112-(AG109-(AG121*2+AG119/2))*AG108,0)))","v":25.175257623172669}]
[null,null,null,null,null,null,null,null,null,null,null,"durum 3 için",{"$f":"IF((M109-M114)>(M121*2+M119/2),M113-(M121*2+M119/2)*M108,IF(AND((M121*2+M119/2)>(M109-M114),(M109-M110)>(M121*2+M119/2)),((M121*2+M119/2)-(M109-M114))*M108,IF(M121*2+M119/2>(M109-M110),M112-(M109-(M121*2+M119/2))*M108,IF((M121*2+M119/2)=(M109-M110),M112-M108*M110,0))))","v":66.430644316884099},null,null,null,null,null,null,null,null,"durum 3 için",{"$f":"IF((W109-W114)>(W121*2+W119/2),W113-(W121*2+W119/2)*W108,IF(AND((W121*2+W119/2)>(W109-W114),(W109-W110)>(W121*2+W119/2)),((W121*2+W119/2)-(W109-W114))*W108,IF(W121*2+W119/2>(W109-W110),W112-(W109-(W121*2+W119/2))*W108,IF((W121*2+W119/2)=(W109-W110),W112-W108*W110,0))))","v":50.404884257626506},null,null,null,null,null,null,null,null,"durum 3 için",{"$f":"IF((AG109-AG114)>(AG121*2+AG119/2),AG113-(AG121*2+AG119/2)*AG108,IF(AND((AG121*2+AG119/2)>(AG109-AG114),(AG109-AG110)>(AG121*2+AG119/2)),((AG121*2+AG119/2)-(AG109-AG114))*AG108,IF(AG121*2+AG119/2>(AG109-AG110),AG112-(AG109-(AG121*2+AG119/2))*AG108,IF((AG121*2+AG119/2)=(AG109-AG110),AG112-AG108*AG110,0))))","v":25.175257623172669}]
[null,null,null,null,null,null,null,null,null,null,null,"sol kolon yüzünden d mesafede kesme kuvveti=",{"$f":"IF(M117=\"durum 1\",M123,IF(M117=\"durum 2\",M124,IF(M117=\"durum 3\",M125,\"hatalı\")))","v":67.301305683115885},null,null,null,null,null,null,null,null,"sol kolon yüzünden d mesafede kesme kuvveti=",{"$f":"IF(W117=\"durum 1\",W123,IF(W117=\"durum 2\",W124,IF(W117=\"durum 3\",W125,\"hatalı\")))","v":83.795115742373497},null,null,null,null,null,null,null,null,"sol kolon yüzünden d mesafede kesme kuvveti=",{"$f":"IF(AG117=\"durum 1\",AG123,IF(AG117=\"durum 2\",AG124,IF(AG117=\"durum 3\",AG125,\"hatalı\")))","v":75.339192376827341}]
[null,null,null,null,null,null,null,null,null,null,null,"sağ kolon yüzünden d mesafede kesme kuvveti=",{"$f":"IF(M117=\"durum 1\",M127,IF(M117=\"durum 2\",M128,IF(M117=\"durum 3\",M129,\"hatalı\")))","v":94.333344316884094},null,null,null,null,null,null,null,null,"sağ kolon yüzünden d mesafede kesme kuvveti=",{"$f":"IF(W117=\"durum 1\",W127,IF(W117=\"durum 2\",W128,IF(W117=\"durum 3\",W129,\"hatalı\")))","v":75.604884257626509},null,null,null,null,null,null,null,null,"sağ kolon yüzünden d mesafede kesme kuvveti=",{"$f":"IF(AG117=\"durum 1\",AG127,IF(AG117=\"durum 2\",AG128,IF(AG117=\"durum 3\",AG129,\"hatalı\")))","v":53.077957623172672}]
[null,null,null,null,null,null,null,null,null,null,null,"sol kolon yüzünden 2h mesafede kesme kuvveti=",{"$f":"IF(M117=\"durum 1\",M131,IF(M117=\"durum 2\",M132,IF(M117=\"durum 3\",M133,\"hatalı\")))","v":39.398605683115889},null,null,null,null,null,null,null,null,"sol kolon yüzünden 2h mesafede kesme kuvveti=",{"$f":"IF(W117=\"durum 1\",W131,IF(W117=\"durum 2\",W132,IF(W117=\"durum 3\",W133,\"hatalı\")))","v":58.595115742373494},null,null,null,null,null,null,null,null,"sol kolon yüzünden 2h mesafede kesme kuvveti=",{"$f":"IF(AG117=\"durum 1\",AG131,IF(AG117=\"durum 2\",AG132,IF(AG117=\"durum 3\",AG133,\"hatalı\")))","v":47.436492376827339}]
[null,null,null,null,null,null,null,null,null,null,null,"sağ kolon yüzünden 2h mesafede kesme kuvveti=",{"$f":"IF(M117=\"durum 1\",M135,IF(M117=\"durum 2\",M136,IF(M117=\"durum 3\",M137,\"hatalı\")))","v":66.430644316884099},null,null,null,null,null,null,null,null,"sağ kolon yüzünden 2h mesafede kesme kuvveti=",{"$f":"IF(W117=\"durum 1\",W135,IF(W117=\"durum 2\",W136,IF(W117=\"durum 3\",W137,\"hatalı\")))","v":50.404884257626506},null,null,null,null,null,null,null,null,"sağ kolon yüzünden 2h mesafede kesme kuvveti=",{"$f":"IF(AG117=\"durum 1\",AG135,IF(AG117=\"durum 2\",AG136,IF(AG117=\"durum 3\",AG137,\"hatalı\")))","v":25.175257623172669}]
[null,"kiriş kolon yüzünden d mesafede kesme kuvveti (KN)",null,null,null,null,null,{"$f":"+M138","v":67.301305683115885},null,null,null,null,null,null,{"$f":"+M139","v":94.333344316884094},null,null,{"$f":"+W138","v":83.795115742373497},null,null,null,null,null,null,{"$f":"+W139","v":75.604884257626509},null,null,{"$f":"+AG138","v":75.339192376827341},null,null,null,null,null,null,{"$f":"+AG139","v":53.077957623172672}]
[]
[]
[]
[]
[null,"kiriş kolon yüzünden 2*h mesafede kesme kuvveti (KN)",null,null,null,null,null,{"$f":"+M140","v":39.398605683115889},null,null,null,null,null,null,{"$f":"+M141","v":66.430644316884099},null,null,{"$f":"+W140","v":58.595115742373494},null,null,null,null,null,null,{"$f":"+W141","v":50.404884257626506},null,null,{"$f":"+AG140","v":47.436492376827339},null,null,null,null,null,null,{"$f":"+AG141","v":25.175257623172669}]
[]
[]
[]
[]
[null,"kiriş kolon yüzü kesme kuvveti (KN)",null,null,null,null,null,{"$f":"+M112-L19*G38/2","v":92.546605683115885},null,null,null,null,null,null,{"$f":"+M113-Q38/2*L19","v":119.57864431688409},null,null,{"$f":"+W112-V19*Q38/2","v":106.59511574237349},null,null,null,null,null,null,{"$f":"+W113-AA38/2*V19","v":98.404884257626506},null,null,{"$f":"+AG112-AF19*AA38/2","v":100.58449237682734},null,null,null,null,null,null,{"$f":"+AG113-AK38/2*AF19","v":78.323257623172665}]
[]
[]
[null,"kiriş kolon yüzü moment (KNm)",null,null,null,null,null,{"$f":"+M105-(M112+H152)/2*G38/2","v":31.45090851350141},null,null,null,null,null,null,{"$f":"+M106-(O152+M113)/2*Q38/2","v":90.118590127336716},null,null,{"$f":"+W105-(W112+R152)/2*Q38/2","v":90.053029917837591},null,null,null,null,null,null,{"$f":"+W106-(Y152+W113)/2*AA38/2","v":70.601230141563519},null,null,{"$f":"+AG105-(AG112+AB152)/2*AA38/2","v":69.186368057266776},null,null,null,null,null,null,{"$f":"+AG106-(AI152+AG113)/2*AK38/2","v":19.569972672791742}]

{"sheet":"4_aciklikli","index":3,"n_rows":155,"n_cols":54,"rows_kept":155,"cut":false,"hidden":false,"merged":[[1,1,1,55],[2,13,2,14],[3,6,3,7],[3,16,3,17],[3,26,3,27],[3,36,3,37],[3,46,3,47],[9,33,9,34],[9,36,10,36],[9,38,9,39],[10,38,10,39],[5,38,6,38],[5,48,6,48],[9,6,10,6],[9,8,9,9],[9,13,9,14],[9,16,10,16],[9,18,9,19],[5,8,6,8],[5,18,6,18],[5,28,6,28],[9,48,9,49],[10,3,10,4],[9,46,10,46],[9,3,9,4],[11,6,13,6],[11,8,11,9],[11,16,13,16],[11,23,11,24],[11,26,13,26],[9,43,9,44],[10,8,10,9],[10,13,10,14],[10,18,10,19],[10,23,10,24],[10,28,10,29],[10,33,10,34],[9,23,9,24],[9,26,10,26],[9,28,9,29],[13,33,13,34],[13,38,13,39],[10,48,10,49],[11,3,11,4],[13,8,13,9],[13,13,13,14],[13,18,13,19],[13,23,13,24],[11,28,11,29],[11,36,13,36],[11,43,11,44],[11,46,13,46],[13,43,13,44],[11,48,11,49],[12,3,12,4],[12,8,12,9],[11,13,11,14],[11,18,11,19],[12,23,12,24],[10,43,10,44],[11,33,11,34],[11,38,11,39],[12,43,12,44],[13,3,13,4],[14,3,14,4],[13,53,15,53],[14,43,14,44],[14,46,15,46],[12,48,12,49],[15,43,15,44],[12,28,12,29],[13,28,13,29],[14,23,14,24],[14,26,15,26],[14,28,14,29],[15,23,15,24],[15,28,15,29],[14,6,15,6],[14,8,14,9],[14,13,14,14],[14,16,15,16],[14,18,14,19],[14,48,14,49],[13,48,13,49],[14,33,14,34],[14,36,15,36],[14,38,14,39],[15,33,15,34],[16,28,16,29],[16,33,16,34],[16,36,18,36],[16,38,16,39],[16,43,16,44],[16,46,18,46],[15,8,15,9],[15,13,15,14],[15,18,15,19],[15,38,15,39],[16,3,16,4],[16,10,16,11],[16,20,16,21],[16,30,16,31],[16,40,16,41],[19,15,19,16],[19,17,19,18],[19,21,19,22],[20,48,20,49],[19,31,19,32],[19,35,19,36],[19,37,19,38],[19,41,19,42],[19,5,19,6],[19,7,19,8],[19,11,19,12],[16,49,16,50],[16,6,18,6],[16,8,16,9],[16,13,16,14],[16,16,18,16],[16,18,16,19],[16,23,16,24],[16,26,18,26],[21,4,21,5],[18,2,18,3],[18,11,18,12],[18,21,18,22],[18,31,18,32],[18,41,18,42],[18,49,18,50],[20,28,20,29],[20,34,20,35],[20,36,22,36],[20,38,20,39],[20,44,20,45],[19,45,19,46],[19,47,19,48],[20,4,20,5],[20,6,22,6],[20,8,20,9],[20,14,20,15],[20,16,22,16],[20,18,20,19],[20,24,20,25],[20,26,22,26],[19,25,19,26],[19,27,19,28],[22,34,22,35],[22,38,22,39],[22,44,22,45],[21,8,21,9],[21,14,21,15],[21,18,21,19],[21,24,21,25],[21,28,21,29],[21,34,21,35],[21,38,21,39],[21,44,21,45],[23,46,24,46],[23,48,23,49],[24,34,24,35],[24,38,24,39],[24,44,24,45],[24,48,24,49],[22,48,22,49],[23,4,23,5],[23,6,24,6],[23,8,23,9],[23,14,23,15],[23,16,24,16],[23,18,23,19],[23,24,23,25],[23,26,24,26],[23,28,23,29],[20,46,22,46],[21,48,21,49],[22,4,22,5],[22,8,22,9],[22,14,22,15],[22,18,22,19],[22,24,22,25],[22,28,22,29],[25,46,27,46],[25,48,25,49],[26,34,26,35],[26,38,26,39],[26,44,26,45],[26,48,26,49],[24,53,26,53],[25,4,25,5],[25,6,27,6],[25,8,25,9],[25,14,25,15],[25,16,27,16],[25,18,25,19],[25,24,25,25],[25,26,27,26],[25,28,25,29],[24,4,24,5],[24,8,24,9],[24,14,24,15],[24,18,24,19],[24,24,24,25],[24,28,24,29],[23,36,24,36],[23,44,23,45],[29,44,29,45],[29,38,29,39],[29,18,29,19],[29,24,29,25],[29,28,29,29],[29,34,29,35],[26,4,26,5],[26,8,26,9],[26,14,26,15],[26,18,26,19],[26,24,26,25],[26,28,26,29],[25,36,27,36],[25,38,25,39],[25,44,25,45],[35,3,35,4],[35,11,35,12],[35,21,35,22],[35,31,35,32],[35,41,35,42],[35,48,35,49],[33,38,33,39],[33,43,33,44],[28,44,28,45],[28,46,29,46],[28,48,28,49],[29,4,29,5],[30,8,30,9],[30,14,30,15],[30,18,30,19],[30,24,30,25],[30,28,30,29],[30,34,30,35],[28,24,28,25],[28,26,29,26],[28,28,28,29],[28,34,28,35],[28,36,29,36],[28,38,28,39],[39,48,40,48],[37,6,37,7],[37,16,37,17],[37,26,37,27],[37,36,37,37],[37,46,37,47],[39,8,40,8],[39,18,40,18],[39,28,40,28],[45,44,47,44],[49,11,49,12],[49,21,49,22],[49,31,49,32],[49,41,49,42],[42,11,42,12],[42,21,42,22],[42,31,42,32],[42,41,42,42],[44,17,44,18],[44,27,44,28],[44,37,44,38],[45,14,47,14],[45,24,47,24],[45,34,47,34],[51,49,51,50],[55,17,55,18],[56,7,56,8],[56,25,56,26],[56,27,56,28],[56,35,56,36],[56,37,56,38],[51,3,51,4],[51,9,51,10],[51,13,51,14],[51,19,51,20],[51,23,51,24],[51,29,51,30],[58,47,58,48],[60,4,60,5],[60,8,60,9],[60,14,60,15],[60,18,60,19],[60,24,60,25],[60,28,60,29],[51,33,51,34],[51,39,51,40],[51,43,51,44],[61,4,61,5],[61,8,61,9],[61,14,61,15],[61,18,61,19],[61,24,61,25],[61,28,61,29],[56,45,56,46],[57,15,57,16],[58,5,58,6],[61,44,61,45],[61,48,61,49],[64,11,64,12],[64,21,64,22],[64,31,64,32],[64,41,64,42],[60,34,60,35],[60,38,60,39],[60,44,60,45],[60,48,60,49],[76,3,76,4],[76,9,76,10],[76,13,76,14],[76,19,76,20],[76,23,76,24],[76,29,76,30],[73,3,73,4],[73,9,73,10],[73,13,73,14],[73,19,73,20],[73,23,73,24],[73,29,73,30],[76,43,76,44],[76,49,76,50],[83,7,83,8],[83,17,83,18],[83,27,83,28],[83,37,83,38],[83,47,83,48],[73,33,73,34],[73,39,73,40],[73,43,73,44],[73,49,73,50],[86,3,86,4],[86,9,86,10],[86,13,86,14],[86,19,86,20],[86,23,86,24],[86,29,86,30],[85,3,85,4],[85,9,85,10],[85,13,85,14],[85,19,85,20],[85,23,85,24],[85,29,85,30],[86,43,86,44],[86,49,86,50],[88,15,88,16],[88,25,88,26],[88,35,88,36],[88,45,88,46],[85,33,85,34],[85,39,85,40],[85,43,85,44],[85,49,85,50],[98,49,98,50],[100,1,103,6],[100,7,103,16],[100,17,103,26],[100,27,103,36],[100,37,103,46],[89,5,89,6],[90,8,90,9],[90,18,90,19],[90,28,90,29],[90,38,90,39],[98,3,98,4],[98,9,98,10],[98,13,98,14],[98,19,98,20],[98,23,98,24],[141,7,145,9],[141,10,145,13],[141,14,145,16],[141,17,145,19],[141,20,145,23],[98,29,98,30],[98,33,98,34],[98,39,98,40],[98,43,98,44],[121,41,121,42],[125,41,125,42],[129,41,129,42],[133,41,133,42],[146,44,150,46],[151,1,153,6],[151,7,153,9],[151,10,153,13],[151,14,153,16],[151,17,153,19],[151,20,153,23],[141,44,145,46],[146,1,150,6],[146,7,150,9],[146,10,150,13],[146,14,150,16],[146,17,150,19],[146,20,150,23],[146,24,150,26],[146,27,150,29],[146,30,150,33],[141,24,145,26],[141,27,145,29],[141,30,145,33],[141,34,145,36],[141,37,145,39],[141,40,145,43],[141,1,145,6],[154,27,156,29],[154,30,156,33],[151,24,153,26],[151,27,153,29],[151,30,153,33],[151,34,153,36],[151,37,153,39],[151,40,153,43],[146,34,150,36],[146,37,150,39],[146,40,150,43],[154,34,156,36],[154,37,156,39],[154,40,156,43],[154,44,156,46],[33,8,33,9],[33,13,33,14],[33,18,33,19],[33,23,33,24],[33,28,33,29],[33,33,33,34],[151,44,153,46],[154,1,156,6],[154,7,156,9],[154,10,156,13],[154,14,156,16],[154,17,156,19],[154,20,156,23],[154,24,156,26],[121,11,121,12],[121,21,121,22],[121,31,121,32],[86,33,86,34],[86,39,86,40],[76,33,76,34],[76,39,76,40],[61,34,61,35],[61,38,61,39],[33,50,33,51],[33,47,33,48],[33,2,33,3],[33,5,33,6],[30,44,30,45],[29,48,29,49],[30,38,30,39],[12,38,12,39],[12,33,12,34],[12,18,12,19],[12,13,12,14],[29,8,29,9],[29,14,29,15],[27,44,27,45],[27,48,27,49],[28,4,28,5],[28,6,29,6],[28,8,28,9],[28,14,28,15],[28,16,29,16],[28,18,28,19],[27,4,27,5],[27,8,27,9],[27,14,27,15],[44,7,44,8],[39,38,40,38],[27,34,27,35],[27,38,27,39],[23,34,23,35],[23,38,23,39],[133,11,133,12],[133,21,133,22],[133,31,133,32],[125,11,125,12],[125,21,125,22],[125,31,125,32],[129,11,129,12],[129,21,129,22],[129,31,129,32],[27,18,27,19],[27,24,27,25],[27,28,27,29],[25,34,25,35]]}
[]
[null,"SAPLAMA KİRİŞLİ ÇERÇEVE CROSS (4 AÇIKLIKLI)\n(inş.müh. Gürcan BERBEROĞLU tel: 0532 366 02 04   www.betoncelik.com )"]
[null,null,null,null,null,null,null,null,"pas payı  d ' =",null,null,null,null,0.03,null,"m",null,null,null,null,null,"dikkat sadece sarı hücrelere rakam giriniz."]
[null,null,null,null,null,null,0.5,null,"m",null,null,null,null,null,null,null,0.5,null,"m",null,null,null,null,null,null,null,0.5,null,"m",null,null,null,null,null,null,null,0.5,null,"m",null,null,null,null,null,null,null,0.5,null,"m"]
[null,null,null,null,null,null,null,null,"m",null,null,null,null,null,null,null,null,null,"m",null,null,null,null,null,null,null,null,null,"m",null,null,null,null,null,null,null,null,null,"m",null,null,null,null,null,null,null,null,null,"m"]
[null,null,null,null,null,null,null,null,0.6,null,null,null,null,null,null,null,null,null,0.6,null,null,null,null,null,null,null,null,null,0.6,null,null,null,null,null,null,null,null,null,0.6,null,null,null,null,null,null,null,null,null,0.6]
[]
[]
[]
[null,null,null,{"$f":"SUM(D11:E15)","v":-2.2470540124372533},null,null,"dm4",null,null,null,null,null,null,null,null,null,"dm4",null,null,null,null,null,null,null,null,null,"dm4",null,null,null,null,null,null,null,null,null,"dm4",null,null,null,null,null,null,null,null,null,"dm4",null,{"$f":"SUM(AW11:AX15)","v":-0.44576264712397706}]
[null,null,null,{"$f":"-I29*G21","v":-7.0248028974907886E-6},null,null,null,null,null,null,null,null,null,null,null,null,null,null,null,null,null,null,null,null,null,null,null,null,null,null,null,null,null,null,null,null,null,null,null,null,null,null,null,null,null,null,null,null,{"$f":"-AS29*AU17","v":-1.2187252462458828E-5}]
[null,null,null,{"$f":"-I27*G21","v":-1.030631878076108E-4},null,null,{"$f":"I6*G4^3/12*10000","v":62.499999999999993},null,{"$f":"SUM(I13:J17)","v":-2.2470540124372533},null,null,null,null,{"$f":"SUM(N13:O17)","v":0.36283490372303545},null,null,{"$f":"S6*Q4^3/12*10000","v":62.499999999999993},null,{"$f":"SUM(S13:T17)","v":0.36283490372303545},null,null,null,null,{"$f":"SUM(X13:Y17)","v":0.74129325054478357},null,null,{"$f":"AC6*AA4^3/12*10000","v":62.499999999999993},null,{"$f":"SUM(AC13:AD17)","v":0.74129325054478357},null,null,null,null,{"$f":"SUM(AH13:AI17)","v":-6.1639687224609364E-2},null,null,{"$f":"AM6*AK4^3/12*10000","v":62.499999999999993},null,{"$f":"SUM(AM13:AN17)","v":-6.1639687224609364E-2},null,null,null,null,{"$f":"SUM(AR13:AS17)","v":-0.44576264712397706},null,null,{"$f":"AW6*AU4^3/12*10000","v":62.499999999999993},null,{"$f":"-AS27*AU17","v":-1.3319846348468507E-4}]
[null,null,null,{"$f":"-I25*G21","v":-1.9889628090463359E-3},null,null,null,null,{"$f":"-I29*G17","v":-7.0248028974907886E-6},null,null,null,null,null,null,null,null,null,null,null,null,null,null,{"$f":"-(Y29+AC29)*AA21","v":-1.5465998889863851E-5},null,null,null,null,{"$f":"-(Y29+AC29)*AA17","v":-1.5465998889863851E-5},null,null,null,null,null,null,null,null,null,null,null,null,null,null,{"$f":"-AS29*AU21","v":-1.2187252462458828E-5},null,null,null,null,{"$f":"-AS25*AU17","v":-9.7577752495291463E-4},null,null,null,null,"m"]
[null,null,null,{"$f":"-I23*G21","v":-5.5060277667130529E-2},null,null,null,null,{"$f":"-I27*G17","v":-1.030631878076108E-4},null,null,null,null,{"$f":"-(O28+S28)*Q21","v":4.4591910915488927E-5},null,null,null,null,{"$f":"-(O28+S28)*Q17","v":4.4591910915488927E-5},null,null,null,null,{"$f":"-(Y27+AC27)*AA21","v":-1.9341636936532651E-4},null,null,null,null,{"$f":"-(Y27+AC27)*AA17","v":-1.9341636936532651E-4},null,null,null,null,{"$f":"-(AI28+AM28)*AK21","v":5.2672023231074392E-5},null,null,null,null,{"$f":"-(AI28+AM28)*AK17","v":5.2672023231074392E-5},null,null,null,null,{"$f":"-AS27*AU21","v":-1.3319846348468507E-4},null,null,null,null,{"$f":"-AS23*AU17","v":1.538335375174647E-2},null,null,null,null,3.5]
[null,null,null,{"$f":"-(E21+I21)*G21","v":-2.1898946839703712},null,null,"I =",null,{"$f":"-I25*G17","v":-1.9889628090463359E-3},null,null,null,null,{"$f":"-(O26+S26)*Q21","v":6.5422255349326141E-4},null,null,"I =",null,{"$f":"-(O26+S26)*Q17","v":6.5422255349326141E-4},null,null,null,null,{"$f":"-(Y25+AC25)*AA21","v":-2.5615176794371061E-3},null,null,"I =",null,{"$f":"-(Y25+AC25)*AA17","v":-2.5615176794371061E-3},null,null,null,null,{"$f":"-(AI26+AM26)*AK21","v":5.7566974874936449E-4},null,null,"I =",null,{"$f":"-(AI26+AM26)*AK17","v":5.7566974874936449E-4},null,null,null,null,{"$f":"-AS25*AU21","v":-9.7577752495291463E-4},null,null,"I =",null,{"$f":"-(AS21+AW21)*AU17","v":-0.46002483763482349}]
[null,null,null,null,null,null,null,null,{"$f":"-I23*G17","v":-5.5060277667130529E-2},null,null,null,null,{"$f":"-(O24+S24)*Q21","v":1.2625500485842085E-2},null,null,null,null,{"$f":"-(O24+S24)*Q17","v":1.2625500485842085E-2},null,null,null,null,{"$f":"-(Y23+AC23)*AA21","v":-3.9776456821028601E-2},null,null,null,null,{"$f":"-(Y23+AC23)*AA17","v":-3.9776456821028601E-2},null,null,null,null,{"$f":"-(AI24+AM24)*AK21","v":4.217207826046036E-3},null,null,null,null,{"$f":"-(AI24+AM24)*AK17","v":4.217207826046036E-3},null,null,null,null,{"$f":"-AS23*AU21","v":1.538335375174647E-2}]
[null,null,null,12,null,"KN",{"$f":"(4*G12/BB14)/((4*G12/BB14)+(4*L20/L36)+(4*G26/BB25))","v":0.34246463644932662},null,{"$f":"-(E21+I21)*G17","v":-2.1898946839703712},null,12,null,"KN",{"$f":"-(O21+O22+S21+S22)*Q21","v":0.34951058877278463},null,null,{"$f":"(4*Q12/BB14)/((4*Q12/BB14)+(4*V20/V36)+(4*Q26/BB25)+(4*L20/L36))","v":0.22179094900474539},null,{"$f":"-(O21+O22+S21+S22)*Q17","v":0.34951058877278463},null,12,null,"KN",{"$f":"-(Y21+AC21)*AA21","v":0.78384010741350441},null,null,{"$f":"(4*AA12/BB14)/((4*AA12/BB14)+(4*AA26/BB25)+(4*V20/V36)+(4*AF20/AF36))","v":0.18395494577369453},null,{"$f":"-(Y21+AC21)*AA17","v":0.78384010741350441},null,12,null,"KN",{"$f":"-(AI21+AM21+AI22+AM22)*AK21","v":-6.6485236822635838E-2},null,null,{"$f":"(4*AK12/BB14)/((4*AK12/BB14)+(4*AK26/BB25)+(4*AF20/AF36)+(4*AP20/AP36))","v":0.17952986549167821},null,{"$f":"-(AI21+AM21+AI22+AM22)*AK17","v":-6.6485236822635838E-2},null,12,null,"KN",{"$f":"-(AS21+AW21)*AU21","v":-0.46002483763482349},null,null,{"$f":"(4*AU12/BB14)/((4*AU12/BB14)+(4*AU26/BB25)+(4*AP20/AP36))","v":0.26862000517821699},null,null,12,null,"KN"]
[]
[null,"q =",10,null,"KN/m",null,null,null,null,null,"q =",10,null,"KN/m",null,null,null,null,null,null,"q =",10,null,"KN/m",null,null,null,null,null,null,"q =",10,null,"KN/m",null,null,null,null,null,null,"q =",10,null,"KN/m",null,null,null,null,"q =",10,null,"KN/m"]
[null,null,null,null,null,0,null,{"$f":"(4*L20/L36)/((4*G12/BB14)+(4*L20/L36)+(4*G26/BB25))","v":0.31507072710134676},null,null,"I =",{"$f":"(L43*H45^3/12+H45*L43*(((H45*L43*H45/2+L50*(O46-H45)*((O46-H45)/2+H45))/(L43*H45+(O46-H45)*L50))-H45/2)^2+L50*(O46-H45)^3/12+L50*(O46-H45)*(O46-((H45*L43*H45/2+L50*(O46-H45)*((O46-H45)/2+H45))/(L43*H45+(O46-H45)*L50))-(O46-H45)/2)^2)*10000","v":82.143707482993193},null,"dm4",null,{"$f":"(4*L20/L36)/((4*Q12/BB14)+(4*V20/V36)+(4*Q26/BB25)+(4*L20/L36))","v":0.20404978537911822},null,{"$f":"(4*V20/V36)/((4*Q12/BB14)+(4*V20/V36)+(4*Q26/BB25)+(4*L20/L36))","v":0.35236831661139101},null,null,"I =",{"$f":"(V43*R45^3/12+R45*V43*(((R45*V43*R45/2+V50*(Y46-R45)*((Y46-R45)/2+R45))/(V43*R45+(Y46-R45)*V50))-R45/2)^2+V50*(Y46-R45)^3/12+V50*(Y46-R45)*(Y46-((R45*V43*R45/2+V50*(Y46-R45)*((Y46-R45)/2+R45))/(V43*R45+(Y46-R45)*V50))-(Y46-R45)/2)^2)*10000","v":127.66666666666663},null,"dm4",null,{"$f":"(4*V20/V36)/((4*AA12/BB14)+(4*AA26/BB25)+(4*V20/V36)+(4*AF20/AF36))","v":0.29225671681142223},null,{"$f":"(4*AF20/AF36)/((4*AA12/BB14)+(4*AA26/BB25)+(4*V20/V36)+(4*AF20/AF36))","v":0.33983339164118859},null,null,"I =",{"$f":"(AF43*AB45^3/12+AB45*AF43*(((AB45*AF43*AB45/2+AF50*(AI46-AB45)*((AI46-AB45)/2+AB45))/(AF43*AB45+(AI46-AB45)*AF50))-AB45/2)^2+AF50*(AI46-AB45)^3/12+AF50*(AI46-AB45)*(AI46-((AB45*AF43*AB45/2+AF50*(AI46-AB45)*((AI46-AB45)/2+AB45))/(AF43*AB45+(AI46-AB45)*AF50))-(AI46-AB45)/2)^2)*10000","v":127.66666666666663},null,"dm4",null,{"$f":"(4*AF20/AF36)/((4*AK12/BB14)+(4*AK26/BB25)+(4*AF20/AF36)+(4*AP20/AP36))","v":0.33165861800736546},null,{"$f":"(4*AP20/AP36)/((4*AK12/BB14)+(4*AK26/BB25)+(4*AF20/AF36)+(4*AP20/AP36))","v":0.30928165100927818},null,null,"I =",{"$f":"(AP43*AL45^3/12+AL45*AP43*(((AL45*AP43*AL45/2+AP50*(AS46-AL45)*((AS46-AL45)/2+AL45))/(AP43*AL45+(AS46-AL45)*AP50))-AL45/2)^2+AP50*(AS46-AL45)^3/12+AP50*(AS46-AL45)*(AS46-((AL45*AP43*AL45/2+AP50*(AS46-AL45)*((AS46-AL45)/2+AL45))/(AP43*AL45+(AS46-AL45)*AP50))-(AS46-AL45)/2)^2)*10000","v":127.66666666666663},null,"dm4",null,{"$f":"(4*AP20/AP36)/((4*AU12/BB14)+(4*AU26/BB25)+(4*AP20/AP36))","v":0.46275998964356596},null,0]
[null,null,null,null,{"$f":"IF(OR(D36=0,D36=\"\"),0,-C19*D36*D36/2-D17*F34)","v":-23.25},null,{"$f":"(4*G26/BB25)/((4*G12/BB14)+(4*L20/L36)+(4*G26/BB25))","v":0.34246463644932662},null,{"$f":"L19*L36^2/12+K17*I34*N34^2/L36^2","v":29.644513333333332},null,null,null,null,null,{"$f":"-L19*L36^2/12-K17*N34*I34^2/L36^2","v":-26.008153333333333},null,{"$f":"(4*Q26/BB25)/((4*Q12/BB14)+(4*V20/V36)+(4*Q26/BB25)+(4*L20/L36))","v":0.22179094900474539},null,{"$f":"V19*V36^2/12+U17*S34*X34^2/V36^2","v":24.817},null,null,null,null,null,{"$f":"-V19*V36^2/12-U17*X34*S34^2/V36^2","v":-21.472999999999999},null,{"$f":"(4*AA26/BB25)/((4*AA12/BB14)+(4*AA26/BB25)+(4*V20/V36)+(4*AF20/AF36))","v":0.18395494577369453},null,{"$f":"AF19*AF36^2/12+AE17*AC34*AH34^2/AF36^2","v":17.211956057328287},null,null,null,null,null,{"$f":"-AF19*AF36^2/12-AE17*AH34*AC34^2/AF36^2","v":-19.051869524067065},null,{"$f":"(4*AK26/BB25)/((4*AK12/BB14)+(4*AK26/BB25)+(4*AF20/AF36)+(4*AP20/AP36))","v":0.17952986549167821},null,{"$f":"AP19*AP36^2/12+AO17*AM34*AR34^2/AP36^2","v":19.094426198770989},null,null,null,null,null,{"$f":"-AP19*AP36^2/12-AO17*AR34*AM34^2/AP36^2","v":-21.537451311269173},null,{"$f":"(4*AU26/BB25)/((4*AU12/BB14)+(4*AU26/BB25)+(4*AP20/AP36))","v":0.26862000517821699},null,{"$f":"IF(OR(AW36=0,AW36=\"\"),0,AX19*AW36*AW36/2+AX17*AV34)","v":23.25}]
[null,null,null,null,null,null,null,null,{"$f":"-(E21+I21)*H20","v":-2.0147239653925895},null,null,null,null,null,{"$f":"+I22/2","v":-1.0073619826962947},null,null,null,{"$f":"+Y22/2","v":0.62265935643721637},null,null,null,null,null,{"$f":"-(Y21+AC21)*Z20","v":1.2453187128744327},null,null,null,{"$f":"-(Y21+AC21)*AB20","v":1.4480450149702704},null,null,null,null,null,{"$f":"+AC22/2","v":0.72402250748513519},null,null,null,{"$f":"+AS22/2","v":-0.39624950673059001},null,null,null,null,null,{"$f":"-(AS21+AW21)*AT20","v":-0.79249901346118001}]
[null,null,null,null,null,null,null,null,{"$f":"+O23/2","v":0.160776535171618},null,null,null,null,null,{"$f":"-(O21+O22+S21+S22)*P20","v":0.32155307034323599},null,null,null,{"$f":"-(O21+O22+S21+S22)*R20","v":0.5552817117036063},null,null,null,null,null,{"$f":"+S23/2","v":0.27764085585180315},null,null,null,{"$f":"+AI23/2","v":-6.1411514184836043E-2},null,null,null,null,null,{"$f":"-(AI21+AM21+AI22+AM22)*AJ20","v":-0.12282302836967209},null,null,null,{"$f":"-(AI21+AI22+AM21+AM22)*AL20","v":-0.11453617344352535},null,null,null,null,null,{"$f":"+AM23/2","v":-5.7268086721762673E-2}]
[null,null,null,null,null,null,"dm4",null,{"$f":"-I23*H20","v":-5.0655979837356931E-2},null,null,null,null,null,{"$f":"+I24/2","v":-2.5327989918678465E-2},null,"dm4",null,{"$f":"+Y24/2","v":-3.1597238736941535E-2},null,null,null,null,null,{"$f":"-(Y23+AC23)*Z20","v":-6.3194477473883071E-2},null,"dm4",null,{"$f":"-(Y23+AC23)*AB20","v":-7.3481950551026812E-2},null,null,null,null,null,{"$f":"+AC24/2","v":-3.6740975275513406E-2},null,"dm4",null,{"$f":"+AS24/2","v":1.3250689609134865E-2},null,null,null,null,null,{"$f":"-AS23*AT20","v":2.6501379218269731E-2},null,"dm4",null,null,null,null,null,null,"m"]
[null,null,null,null,null,null,null,null,{"$f":"+O25/2","v":5.8077903449182452E-3},null,null,null,null,null,{"$f":"-(O24+S24)*P20","v":1.161558068983649E-2},null,null,null,{"$f":"-(O24+S24)*R20","v":2.0058646994099337E-2},null,null,null,null,null,{"$f":"+S25/2","v":1.0029323497049668E-2},null,null,null,{"$f":"+AI25/2","v":3.8953778403546667E-3},null,null,null,null,null,{"$f":"-(AI24+AM24)*AJ20","v":7.7907556807093334E-3},null,null,null,{"$f":"-(AI24+AM24)*AL20","v":7.2651143335771377E-3},null,null,null,null,null,{"$f":"+AM25/2","v":3.6325571667885689E-3},null,null,null,null,null,null,null,null,3.5]
[null,null,null,null,null,null,{"$f":"I40*G38^3/12*10000","v":62.499999999999993},null,{"$f":"-I25*H20","v":-1.8298647268255731E-3},null,null,null,null,null,{"$f":"+I26/2","v":-9.1493236341278655E-4},null,{"$f":"S40*Q38^3/12*10000","v":62.499999999999993},null,{"$f":"+Y26/2","v":-2.0347937477247055E-3},null,null,null,null,null,{"$f":"-(Y25+AC25)*Z20","v":-4.069587495449411E-3},null,{"$f":"AC40*AA38^3/12*10000","v":62.499999999999993},null,{"$f":"-(Y25+AC25)*AB20","v":-4.7320784830807098E-3},null,null,null,null,null,{"$f":"+AC26/2","v":-2.3660392415403549E-3},null,{"$f":"AM40*AK38^3/12*10000","v":62.499999999999993},null,{"$f":"+AS26/2","v":-8.405010584413697E-4},null,null,null,null,null,{"$f":"-AS25*AT20","v":-1.6810021168827394E-3},null,{"$f":"AW40*AU38^3/12*10000","v":62.499999999999993}]
[null,null,null,null,null,null,null,null,{"$f":"+O27/2","v":3.0094548995239316E-4},null,null,null,null,null,{"$f":"-(O26+S26)*P20","v":6.0189097990478633E-4},null,null,null,{"$f":"-(O26+S26)*R20","v":1.039390024246183E-3},null,null,null,null,null,{"$f":"+S27/2","v":5.1969501212309152E-4},null,null,null,{"$f":"+AI27/2","v":5.317383622384309E-4},null,null,null,null,null,{"$f":"-(AI26+AM26)*AJ20","v":1.0634767244768618E-3},null,null,null,{"$f":"-(AI26+AM26)*AL20","v":9.9172407800613392E-4},null,null,null,null,null,{"$f":"+AM27/2","v":4.9586203900306696E-4}]
[null,null,null,null,null,null,null,null,{"$f":"-I27*H20","v":-9.4819114337171554E-5},null,null,null,null,null,{"$f":"+I28/2","v":-4.7409557168585777E-5},null,null,null,{"$f":"+Y28/2","v":-1.5364423296842676E-4},null,null,null,null,null,{"$f":"-(Y27+AC27)*Z20","v":-3.0728846593685352E-4},null,null,null,{"$f":"-(Y27+AC27)*AB20","v":-3.5731216969401566E-4},null,null,null,null,null,{"$f":"+AC28/2","v":-1.7865608484700783E-4},null,null,null,{"$f":"+AS28/2","v":-1.1473255601684838E-4},null,null,null,null,null,{"$f":"-AS27*AT20","v":-2.2946511203369676E-4}]
[null,null,null,null,null,null,"I =",null,{"$f":"+O29/2","v":2.0512491363557843E-5},null,null,null,null,null,{"$f":"-(O28+S28)*P20","v":4.1024982727115686E-5},null,"I =",null,{"$f":"-(O28+S28)*R20","v":7.0844985578919002E-5},null,null,null,null,null,{"$f":"+S29/2","v":3.5422492789459501E-5},null,"I =",null,{"$f":"+AI29/2","v":4.8652435583982913E-5},null,null,null,null,null,{"$f":"-(AI28+AM28)*AJ20","v":9.7304871167965825E-5},null,"I =",null,{"$f":"-(AI28+AM28)*AL20","v":9.073972323374164E-5},null,null,null,null,null,{"$f":"+AM29/2","v":4.536986161687082E-5},null,"I ="]
[null,null,null,null,null,null,null,null,{"$f":"-I29*H20","v":-6.462885568576265E-6},null,null,null,null,null,null,null,null,null,null,null,null,null,null,null,{"$f":"-(Y29+AC29)*Z20","v":-2.4571462532577769E-5},null,null,null,{"$f":"-(Y29+AC29)*AB20","v":-2.8571468061136936E-5},null,null,null,null,null,null,null,null,null,null,null,null,null,null,null,{"$f":"-AS29*AT20","v":-2.099535669195316E-5}]
[null,null,null,null,null,null,null,null,{"$f":"SUM(I21:J30)","v":27.744108024874503},null,null,null,null,null,{"$f":"SUM(O21:P30)","v":-26.707994080873185},null,null,null,{"$f":"SUM(S21:T30)","v":25.98232427342711},null,null,null,null,null,{"$f":"SUM(Y21:Z30)","v":-20.007051915169601},null,null,null,{"$f":"SUM(AC21:AD30)","v":18.524465414080034},null,null,null,null,null,{"$f":"SUM(AI21:AJ30)","v":-18.481004178277153},null,null,null,{"$f":"SUM(AM21:AN30)","v":18.604283552726365},null,null,null,null,null,{"$f":"SUM(AS21:AT30)","v":-22.358474705752048}]
[]
[]
[null,null,0.5,null,"m",{"$f":"+D36-C34","v":1},null,"m",1.85,null,"m",null,null,{"$f":"+L36-I34","v":3.15},null,"m",null,null,1.65,null,"m",null,null,{"$f":"+V36-S34","v":2.85},null,"m",null,null,2.25,null,"m",null,null,{"$f":"+AF36-AC34","v":1.62},null,"m",null,null,2.5,null,"m",null,null,{"$f":"+AP36-AM34","v":1.6500000000000004},null,"m",null,{"$f":"+AW36-AY34","v":1},null,"m",0.5,null,"m"]
[]
[null,null,null,1.5,null,"m",null,null,null,null,null,5,null,"m",null,null,null,null,null,null,null,4.5,null,"m",null,null,null,null,null,null,null,3.87,null,"m",null,null,null,null,null,null,null,4.1500000000000004,null,"m",null,null,null,null,1.5,null,"m"]
[]
[null,null,null,null,null,null,0.5,null,"m",null,null,null,null,null,null,null,0.5,null,"m",null,null,null,null,null,null,null,0.5,null,"m",null,null,null,null,null,null,null,0.5,null,"m",null,null,null,null,null,null,null,0.5,null,"m"]
[null,null,null,null,null,null,null,null,"m",null,null,null,null,null,null,null,null,null,"m",null,null,null,null,null,null,null,null,null,"m",null,null,null,null,null,null,null,null,null,"m",null,null,null,null,null,null,null,null,null,"m"]
[null,null,null,null,null,null,null,null,0.6,null,null,null,null,null,null,null,null,null,0.6,null,null,null,null,null,null,null,null,null,0.6,null,null,null,null,null,null,null,null,null,0.6,null,null,null,null,null,null,null,null,null,0.6]
[]
[]
[null,null,null,null,null,null,null,null,null,null,null,1.2,null,"m",null,null,null,null,null,null,null,1.2,null,"m",null,null,null,null,null,null,null,1.2,null,"m",null,null,null,null,null,null,null,1.2,null,"m"]
[]
[null,null,null,null,null,null,null,0.1,null,"m",null,null,null,null,"m",null,null,0.1,null,"m",null,null,null,null,"m",null,null,0.1,null,"m",null,null,null,null,"m",null,null,0.1,null,"m",null,null,null,null,"m"]
[null,null,null,null,null,null,null,null,null,null,null,null,null,null,0.6,null,null,null,null,null,null,null,null,null,0.7,null,null,null,null,null,null,null,null,null,0.7,null,null,null,null,null,null,null,null,null,0.7]
[]
[]
[]
[null,null,null,null,null,null,null,null,null,null,null,0.25,null,"m",null,null,null,null,null,null,null,0.25,null,"m",null,null,null,null,null,null,null,0.25,null,"m",null,null,null,null,null,null,null,0.25,null,"m"]
[]
[null,null,null,{"$f":"IF(I12<0,I12/2,\"\")","v":-1.1235270062186267},null,null,null,null,null,{"$f":"IF(I12>0,I12/2,\"\")","v":""},null,null,null,{"$f":"IF(S12<0,S12/2,\"\")","v":""},null,null,null,null,null,{"$f":"IF(S12>0,S12/2,\"\")","v":0.18141745186151773},null,null,null,{"$f":"IF(AC12<0,AC12/2,\"\")","v":""},null,null,null,null,null,{"$f":"IF(AC12>0,AC12/2,\"\")","v":0.37064662527239178},null,null,null,{"$f":"IF(AM12<0,AM12/2,\"\")","v":-3.0819843612304682E-2},null,null,null,null,null,{"$f":"IF(AM12>0,AM12/2,\"\")","v":""},null,null,null,{"$f":"IF(AW10<0,AW10/2,\"\")","v":-0.22288132356198853},null,null,null,null,null,{"$f":"IF(AW10>0,AW10/2,\"\")","v":""}]
[]
[]
[null,null,null,null,null,null,null,null,null,"moment diyagramı (KNm)"]
[null,null,null,null,null,null,null,null,null,null,null,null,null,null,null,null,null,{"$f":"-S31","v":-25.98232427342711}]
[null,null,null,null,null,null,null,{"$f":"-I31","v":-27.744108024874503},null,null,null,null,null,null,null,null,null,null,null,null,null,null,null,null,null,{"$f":"Y31","v":-20.007051915169601},null,{"$f":"-AC31","v":-18.524465414080034},null,null,null,null,null,null,null,{"$f":"AI31","v":-18.481004178277153},null,{"$f":"-AM31","v":-18.604283552726365},null,null,null,null,null,null,null,{"$f":"AS31","v":-22.358474705752048}]
[null,null,null,null,null,null,null,null,null,null,null,null,null,null,null,{"$f":"O31","v":-26.707994080873185}]
[null,null,null,null,null,{"$f":"IF(E21=0,\"\",+E21)","v":-23.25},null,null,null,null,null,null,null,null,null,null,null,null,null,null,null,null,null,null,null,null,null,null,null,null,null,null,null,null,null,null,null,null,null,null,null,null,null,null,null,null,null,{"$f":"IF(AW21=0,\"\",-AW21)","v":-23.25}]
[]
[null,null,null,null,{"$f":"IF(I12>0,-I12,\"\")","v":""},null,null,null,{"$f":"IF(I12<0,-I12,\"\")","v":2.2470540124372533},null,null,null,null,null,{"$f":"IF(S12>0,-S12,\"\")","v":-0.36283490372303545},null,null,null,{"$f":"IF(S12<0,-S12,\"\")","v":""},null,null,null,null,null,{"$f":"IF(AC12>0,-AC12,\"\")","v":-0.74129325054478357},null,null,null,{"$f":"IF(AC12<0,-AC12,\"\")","v":""},null,null,null,null,null,{"$f":"IF(AM12>0,-AM12,\"\")","v":""},null,null,null,{"$f":"IF(AM12<0,-AM12,\"\")","v":6.1639687224609364E-2},null,null,null,null,null,{"$f":"IF(AW10>0,-AW10,\"\")","v":""},null,null,null,{"$f":"IF(AW10<0,-AW10,\"\")","v":0.44576264712397706}]
[null,null,null,null,{"$f":"IF(D10<0,D10,\"\")","v":-2.2470540124372533},null,null,null,{"$f":"IF(D10>0,D10,\"\")","v":""},null,null,null,null,null,{"$f":"IF(N12<0,N12,\"\")","v":""},null,null,null,{"$f":"IF(N12>0,N12,\"\")","v":0.36283490372303545},null,null,null,null,null,{"$f":"IF(X12<0,X12,\"\")","v":""},null,null,null,{"$f":"IF(X12>0,X12,\"\")","v":0.74129325054478357},null,null,null,null,null,{"$f":"IF(AH12<0,AH12,\"\")","v":-6.1639687224609364E-2},null,null,null,{"$f":"IF(AH12>0,AH12,\"\")","v":""},null,null,null,null,null,{"$f":"IF(AR12<0,AR12,\"\")","v":-0.44576264712397706},null,null,null,{"$f":"IF(AR12>0,AR12,\"\")","v":""}]
[]
[]
[null,null,null,null,null,null,null,null,null,null,null,{"$f":"+M116","v":16.019769093108746},null,null,null,null,null,null,null,null,null,{"$f":"+W116","v":12.689720780685235},null,null,null,null,null,null,null,null,null,{"$f":"+AG116","v":11.028128327665836},null,null,null,null,null,null,null,null,null,{"$f":"+AQ116","v":11.694221503083735}]
[]
[]
[]
[]
[]
[]
[]
[]
[null,null,null,{"$f":"IF(D10>0,-D10/2,\"\")","v":""},null,null,null,null,null,{"$f":"IF(D10<0,-D10/2,\"\")","v":1.1235270062186267},null,null,null,{"$f":"IF(N12>0,-N12/2,\"\")","v":-0.18141745186151773},null,null,null,null,null,{"$f":"IF(N12<0,-N12/2,\"\")","v":""},null,null,null,{"$f":"IF(X12>0,-X12/2,\"\")","v":-0.37064662527239178},null,null,null,null,null,{"$f":"IF(X12<0,-X12/2,\"\")","v":""},null,null,null,{"$f":"IF(AH12>0,-AH12/2,\"\")","v":""},null,null,null,null,null,{"$f":"IF(AH12<0,-AH12/2,\"\")","v":3.0819843612304682E-2},null,null,null,{"$f":"IF(AR12>0,-AR12/2,\"\")","v":""},null,null,null,null,null,{"$f":"IF(AR12<0,-AR12/2,\"\")","v":0.22288132356198853}]
[]
[]
[null,null,null,{"$f":"IF(I12<0,(I12+I12/2)/$BB$14,\"\")","v":-0.96302314818739432},null,null,null,null,null,{"$f":"IF(I12>0,(I12+I12/2)/$BB$14,\"\")","v":""},null,null,null,{"$f":"IF(S12<0,(S12+S12/2)/$BB$14,\"\")","v":""},null,null,null,null,null,{"$f":"IF(S12>0,(S12+S12/2)/$BB$14,\"\")","v":0.15550067302415807},null,null,null,{"$f":"IF(AC12<0,(AC12+AC12/2)/$BB$14,\"\")","v":""},null,null,null,null,null,{"$f":"IF(AC12>0,(AC12+AC12/2)/$BB$14,\"\")","v":0.31769710737633577},null,null,null,{"$f":"IF(AM12<0,(AM12+AM12/2)/$BB$14,\"\")","v":-2.6417008810546871E-2},null,null,null,null,null,{"$f":"IF(AM12>0,(AM12+AM12/2)/$BB$14,\"\")","v":""},null,null,null,{"$f":"IF(AW10<0,(AW10+AW10/2)/$BB$14,\"\")","v":-0.19104113448170446},null,null,null,null,null,{"$f":"IF(AW10>0,(AW10+AW10/2)/$BB$14,\"\")","v":""}]
[]
[]
[null,null,null,null,null,null,null,null,null,"kesme kuvveti diyagramı (KN)"]
[]
[]
[]
[null,null,null,null,null,null,null,{"$f":"+M112","v":32.767222788800261},null,null,null,null,null,null,null,null,null,{"$f":"+W112","v":31.427838301834999},null,null,null,null,null,null,null,null,null,{"$f":"+AG112","v":24.384486107442608},null,null,null,null,null,null,null,null,null,{"$f":"+AQ112","v":24.616459963126339},null,null,null,null,null,null,null,null,null,{"$f":"IF(AW21=0,\"\",AX19*AW36+AX17)","v":27}]
[]
[null,null,null,{"$f":"IF(D77<0,D77,\"\")","v":-0.96302314818739432},null,null,null,null,null,{"$f":"IF(J77>0,J77,\"\")","v":""},null,null,null,{"$f":"IF(N77<0,N77,\"\")","v":""},null,null,null,null,null,{"$f":"IF(T77>0,T77,\"\")","v":0.15550067302415807},null,null,null,{"$f":"IF(X77<0,X77,\"\")","v":""},null,null,null,null,null,{"$f":"IF(AD77>0,AD77,\"\")","v":0.31769710737633577},null,null,null,{"$f":"IF(AH77<0,AH77,\"\")","v":-2.6417008810546871E-2},null,null,null,null,null,{"$f":"IF(AN77>0,AN77,\"\")","v":""},null,null,null,{"$f":"IF(AR77<0,AR77,\"\")","v":-0.19104113448170446},null,null,null,null,null,{"$f":"IF(AX77>0,AX77,\"\")","v":""}]
[null,null,null,{"$f":"IF(D99<0,D99,\"\")","v":-0.96302314818739432},null,null,null,null,null,{"$f":"IF(J99>0,J99,\"\")","v":""},null,null,null,{"$f":"IF(N99<0,N99,\"\")","v":""},null,null,null,null,null,{"$f":"IF(T99>0,T99,\"\")","v":0.15550067302415807},null,null,null,{"$f":"IF(X99<0,X99,\"\")","v":""},null,null,null,null,null,{"$f":"IF(AD99>0,AD99,\"\")","v":0.31769710737633577},null,null,null,{"$f":"IF(AH99<0,AH99,\"\")","v":-2.6417008810546871E-2},null,null,null,null,null,{"$f":"IF(AN99>0,AN99,\"\")","v":""},null,null,null,{"$f":"IF(AR99<0,AR99,\"\")","v":-0.19104113448170446},null,null,null,null,null,{"$f":"IF(AX99>0,AX99,\"\")","v":""}]
[]
[null,null,null,null,null,null,null,null,null,null,null,null,null,null,null,{"$f":"-M113","v":-29.232777211199739},null,null,null,null,null,null,null,null,null,{"$f":"-W113","v":-25.572161698165001},null,null,null,null,null,null,null,null,null,{"$f":"-AG113","v":-26.315513892557394},null,null,null,null,null,null,null,null,null,{"$f":"-AQ113","v":-28.883540036873661}]
[null,null,null,null,null,{"$f":"IF(E21=0,\"\",-C19*D36-D17)","v":-27}]
[null,null,null,null,null,null,null,null,{"$f":"+M114","v":2.0767222788800264},null,"m",null,null,null,null,null,null,null,{"$f":"+W114","v":1.9427838301834999},null,"m",null,null,null,null,null,null,null,{"$f":"+AG114","v":2.25},null,"m",null,null,null,null,null,null,null,{"$f":"+AQ114","v":2.461645996312634},null,"m"]
[]
[]
[]
[]
[]
[]
[]
[null,null,null,{"$f":"IF(D10<0,(D10+D10/2)/$BB$25,\"\")","v":-0.96302314818739432},null,null,null,null,null,{"$f":"IF(D10>0,(D10+D10/2)/$BB$25,\"\")","v":""},null,null,null,{"$f":"IF(N12<0,(N12+N12/2)/$BB$25,\"\")","v":""},null,null,null,null,null,{"$f":"IF(N12>0,(N12+N12/2)/$BB$25,\"\")","v":0.15550067302415807},null,null,null,{"$f":"IF(X12<0,(X12+X12/2)/$BB$25,\"\")","v":""},null,null,null,null,null,{"$f":"IF(X12>0,(X12+X12/2)/$BB$25,\"\")","v":0.31769710737633577},null,null,null,{"$f":"IF(AH12<0,(AH12+AH12/2)/$BB$25,\"\")","v":-2.6417008810546871E-2},null,null,null,null,null,{"$f":"IF(AH12>0,(AH12+AH12/2)/$BB$25,\"\")","v":""},null,null,null,{"$f":"IF(AR12<0,(AR12+AR12/2)/$BB$25,\"\")","v":-0.19104113448170446},null,null,null,null,null,{"$f":"IF(AR12>0,(AR12+AR12/2)/$BB$25,\"\")","v":""}]
[]
[null,"kiriş faydalı yükseklik \nd = h - d'     (m)",null,null,null,null,null,{"$f":"O46-N3","v":0.56999999999999995},null,null,null,null,null,null,null,null,null,{"$f":"Y46-N3","v":0.66999999999999993},null,null,null,null,null,null,null,null,null,{"$f":"AI46-N3","v":0.66999999999999993},null,null,null,null,null,null,null,null,null,{"$f":"AS46-N3","v":0.66999999999999993}]
[]
[]
[]
[null,null,null,{"$f":"IF(OR(C19=0,C19=\"\",D36=0,D36=\"\"),0,IF(OR(D17=0,D17=\"\",C34=0,C34=\"\"),1,2))","v":2},null,null,null,null,null,null,null,"sol moment     M1=",{"$f":"+I31","v":27.744108024874503},{"$f":"IF(M110=0,0,IF(M117=\"durum 1\",1,IF(M117=\"durum 2\",2,IF(M117=\"durum 3\",3))))","v":3},null,null,null,null,null,null,null,"sol moment     M1=",{"$f":"+S31","v":25.98232427342711},{"$f":"IF(W110=0,0,IF(W117=\"durum 1\",1,IF(W117=\"durum 2\",2,IF(W117=\"durum 3\",3))))","v":3},null,null,null,null,null,null,null,"sol moment     M1=",{"$f":"+AC31","v":18.524465414080034},{"$f":"IF(AG110=0,0,IF(AG117=\"durum 1\",1,IF(AG117=\"durum 2\",2,IF(AG117=\"durum 3\",3))))","v":2},null,null,null,null,null,null,null,"sol moment     M1=",{"$f":"+AM31","v":18.604283552726365},{"$f":"IF(AQ110=0,0,IF(AQ117=\"durum 1\",1,IF(AQ117=\"durum 2\",2,IF(AQ117=\"durum 3\",3))))","v":1},null,null,null,null,null,null,{"$f":"IF(OR(AW36=0,AW36=\"\",AX19=0,AX19=\"\"),0,IF(OR(AX17=0,AX17=\"\",AY34=0,AY34=\"\"),1,2))","v":2}]
[null,null,null,null,null,null,null,null,null,null,null,"sağ moment     M2=",{"$f":"-O31","v":26.707994080873185},null,null,null,null,null,null,null,null,"sağ moment     M2=",{"$f":"-Y31","v":20.007051915169601},null,null,null,null,null,null,null,null,"sağ moment     M2=",{"$f":"-AI31","v":18.481004178277153},null,null,null,null,null,null,null,null,"sağ moment     M2=",{"$f":"-AS31","v":22.358474705752048}]
[null,null,null,null,null,null,null,null,null,null,null,"tekil yük        K=",{"$f":"+K17","v":12},null,null,null,null,null,null,null,null,"tekil yük        K=",{"$f":"+U17","v":12},null,null,null,null,null,null,null,null,"tekil yük        K=",{"$f":"+AE17","v":12},null,null,null,null,null,null,null,null,"tekil yük        K=",{"$f":"+AO17","v":12}]
[null,null,null,null,null,null,null,null,null,null,null,"yayılı yük      Pd=",{"$f":"+L19","v":10},null,null,null,null,null,null,null,null,"yayılı yük      Pd=",{"$f":"+V19","v":10},null,null,null,null,null,null,null,null,"yayılı yük      Pd=",{"$f":"+AF19","v":10},null,null,null,null,null,null,null,null,"yayılı yük      Pd=",{"$f":"+AP19","v":10}]
[null,null,null,null,null,null,null,null,null,null,null,"L=",{"$f":"+L36","v":5},null,null,null,null,null,null,null,null,"L=",{"$f":"+V36","v":4.5},null,null,null,null,null,null,null,null,"L=",{"$f":"+AF36","v":3.87},null,null,null,null,null,null,null,null,"L=",{"$f":"+AP36","v":4.1500000000000004}]
[null,null,null,null,null,null,null,null,null,null,null,"(K=0 ise a=0 alınacak)     a=",{"$f":"IF(OR(K17=0,K17=\"\",I34=0,I34=\"\"),0,I34)","v":1.85},null,null,null,null,null,null,null,null,"(K=0 ise a=0 alınacak)     a=",{"$f":"IF(OR(U17=0,U17=\"\",S34=0,S34=\"\"),0,S34)","v":1.65},null,null,null,null,null,null,null,null,"(K=0 ise a=0 alınacak)     a=",{"$f":"IF(OR(AE17=0,AE17=\"\",AC34=0,AC34=\"\"),0,AC34)","v":2.25},null,null,null,null,null,null,null,null,"(K=0 ise a=0 alınacak)     a=",{"$f":"IF(OR(AO17=0,AO17=\"\",AM34=0,AM34=\"\"),0,AM34)","v":2.5}]
[null,null,null,null,null,null,null,null,null,null,null,"b=",{"$f":"M109-M110","v":3.15},null,null,null,null,null,null,null,null,"b=",{"$f":"W109-W110","v":2.85},null,null,null,null,null,null,null,null,"b=",{"$f":"AG109-AG110","v":1.62},null,null,null,null,null,null,null,null,"b=",{"$f":"AQ109-AQ110","v":1.6500000000000004}]
[null,null,null,null,null,null,null,null,null,null,null,"(sol eksen kesme kuvveti)  A=",{"$f":"IF(M107>0,M108*M109+M107-M113,M108*M109-M113)","v":32.767222788800261},null,null,null,null,null,null,null,null,"(sol eksen kesme kuvveti)  A=",{"$f":"IF(W107>0,W108*W109+W107-W113,W108*W109-W113)","v":31.427838301834999},null,null,null,null,null,null,null,null,"(sol eksen kesme kuvveti)  A=",{"$f":"IF(AG107>0,AG108*AG109+AG107-AG113,AG108*AG109-AG113)","v":24.384486107442608},null,null,null,null,null,null,null,null,"(sol eksen kesme kuvveti)  A=",{"$f":"IF(AQ107>0,AQ108*AQ109+AQ107-AQ113,AQ108*AQ109-AQ113)","v":24.616459963126339}]
[null,null,null,null,null,null,null,null,null,null,null,"(sağ eksen kesme kuvveti)  B=",{"$f":"IF(M107>0,(M108*M109^2*0.5+M107*M110+M106-M105)/M109,(0.5*M108*M109^2+M106-M105)/M109)","v":29.232777211199739},null,null,null,null,null,null,null,null,"(sağ eksen kesme kuvveti)  B=",{"$f":"IF(W107>0,(W108*W109^2*0.5+W107*W110+W106-W105)/W109,(0.5*W108*W109^2+W106-W105)/W109)","v":25.572161698165001},null,null,null,null,null,null,null,null,"(sağ eksen kesme kuvveti)  B=",{"$f":"IF(AG107>0,(AG108*AG109^2*0.5+AG107*AG110+AG106-AG105)/AG109,(0.5*AG108*AG109^2+AG106-AG105)/AG109)","v":26.315513892557394},null,null,null,null,null,null,null,null,"(sağ eksen kesme kuvveti)  B=",{"$f":"IF(AQ107>0,(AQ108*AQ109^2*0.5+AQ107*AQ110+AQ106-AQ105)/AQ109,(0.5*AQ108*AQ109^2+AQ106-AQ105)/AQ109)","v":28.883540036873661}]
[null,null,null,null,null,null,null,null,null,null,null,"(max mom yeri A'dan mesafesi)  x=",{"$f":"IF(M108*M110>M112,(M112*M110)/(M110*M108),IF(AND(M108*M110<M112,M107>M112-M108*M110),M110,IF(AND(M108*M110<M112,M107<M112-M108*M110),((M109-M110)*(M112-M108*M110-M107)/(M112-M108*M110-M107+M113))+M110,\"HATALI\")))","v":2.0767222788800264},null,null,null,null,null,null,null,null,"(max mom yeri A'dan mesafesi)  x=",{"$f":"IF(W108*W110>W112,(W112*W110)/(W110*W108),IF(AND(W108*W110<W112,W107>W112-W108*W110),W110,IF(AND(W108*W110<W112,W107<W112-W108*W110),((W109-W110)*(W112-W108*W110-W107)/(W112-W108*W110-W107+W113))+W110,\"HATALI\")))","v":1.9427838301834999},null,null,null,null,null,null,null,null,"(max mom yeri A'dan mesafesi)  x=",{"$f":"IF(AG108*AG110>AG112,(AG112*AG110)/(AG110*AG108),IF(AND(AG108*AG110<AG112,AG107>AG112-AG108*AG110),AG110,IF(AND(AG108*AG110<AG112,AG107<AG112-AG108*AG110),((AG109-AG110)*(AG112-AG108*AG110-AG107)/(AG112-AG108*AG110-AG107+AG113))+AG110,\"HATALI\")))","v":2.25},null,null,null,null,null,null,null,null,"(max mom yeri A'dan mesafesi)  x=",{"$f":"IF(AQ108*AQ110>AQ112,(AQ112*AQ110)/(AQ110*AQ108),IF(AND(AQ108*AQ110<AQ112,AQ107>AQ112-AQ108*AQ110),AQ110,IF(AND(AQ108*AQ110<AQ112,AQ107<AQ112-AQ108*AQ110),((AQ109-AQ110)*(AQ112-AQ108*AQ110-AQ107)/(AQ112-AQ108*AQ110-AQ107+AQ113))+AQ110,\"HATALI\")))","v":2.461645996312634}]
[null,null,null,null,null,null,null,null,null,null,null,"açıklık momenti  Mmax=",{"$f":"IF(M108*M110>M112,(M112*M114/2)-M105,IF(AND(M108*M110<M112,M107>M112-M108*M110),(((M112+M112-M110*M108)/2)*M110)-M105,IF(AND(M108*M110<M112,M107<M112-M108*M110),(((M109-M110)*(M112-M108*M110-M107)/(M112-M108*M110-M107+M113))*(M112-M110*M108-M107)/2+(M112+M112-M110*M108)*M110/2)-M105,\"HATALI\")))","v":16.019769093108746},null,null,null,null,null,null,null,null,"açıklık momenti  Mmax=",{"$f":"IF(W108*W110>W112,(W112*W114/2)-W105,IF(AND(W108*W110<W112,W107>W112-W108*W110),(((W112+W112-W110*W108)/2)*W110)-W105,IF(AND(W108*W110<W112,W107<W112-W108*W110),(((W109-W110)*(W112-W108*W110-W107)/(W112-W108*W110-W107+W113))*(W112-W110*W108-W107)/2+(W112+W112-W110*W108)*W110/2)-W105,\"HATALI\")))","v":12.689720780685235},null,null,null,null,null,null,null,null,"açıklık momenti  Mmax=",{"$f":"IF(AG108*AG110>AG112,(AG112*AG114/2)-AG105,IF(AND(AG108*AG110<AG112,AG107>AG112-AG108*AG110),(((AG112+AG112-AG110*AG108)/2)*AG110)-AG105,IF(AND(AG108*AG110<AG112,AG107<AG112-AG108*AG110),(((AG109-AG110)*(AG112-AG108*AG110-AG107)/(AG112-AG108*AG110-AG107+AG113))*(AG112-AG110*AG108-AG107)/2+(AG112+AG112-AG110*AG108)*AG110/2)-AG105,\"HATALI\")))","v":11.028128327665836},null,null,null,null,null,null,null,null,"açıklık momenti  Mmax=",{"$f":"IF(AQ108*AQ110>AQ112,(AQ112*AQ114/2)-AQ105,IF(AND(AQ108*AQ110<AQ112,AQ107>AQ112-AQ108*AQ110),(((AQ112+AQ112-AQ110*AQ108)/2)*AQ110)-AQ105,IF(AND(AQ108*AQ110<AQ112,AQ107<AQ112-AQ108*AQ110),(((AQ109-AQ110)*(AQ112-AQ108*AQ110-AQ107)/(AQ112-AQ108*AQ110-AQ107+AQ113))*(AQ112-AQ110*AQ108-AQ107)/2+(AQ112+AQ112-AQ110*AQ108)*AQ110/2)-AQ105,\"HATALI\")))","v":11.694221503083735}]
[null,null,null,null,null,null,null,null,null,null,null,"x'den bağımsız hesap        Mmax=",{"$f":"IF(M108*M110>M112,(M112*(IF(M108*M110>M112,(M112*M110)/(M110*M108),IF(AND(M108*M110<M112,M107>M112-M108*M110),M110,IF(AND(M108*M110<M112,M107<M112-M108*M110),((M109-M110)*(M112-M108*M110-M107)/(M112-M108*M110-M107+M113))+M110,\"HATALI\"))))/2)-M105,IF(AND(M108*M110<M112,M107>M112-M108*M110),(((M112+M112-M110*M108)/2)*M110)-M105,IF(AND(M108*M110<M112,M107<M112-M108*M110),(((M109-M110)*(M112-M108*M110-M107)/(M112-M108*M110-M107+M113))*(M112-M110*M108-M107)/2+(M112+M112-M110*M108)*M110/2)-M105,\"HATALI\")))","v":16.019769093108746},null,null,null,null,null,null,null,null,"x'den bağımsız hesap        Mmax=",{"$f":"IF(W108*W110>W112,(W112*(IF(W108*W110>W112,(W112*W110)/(W110*W108),IF(AND(W108*W110<W112,W107>W112-W108*W110),W110,IF(AND(W108*W110<W112,W107<W112-W108*W110),((W109-W110)*(W112-W108*W110-W107)/(W112-W108*W110-W107+W113))+W110,\"HATALI\"))))/2)-W105,IF(AND(W108*W110<W112,W107>W112-W108*W110),(((W112+W112-W110*W108)/2)*W110)-W105,IF(AND(W108*W110<W112,W107<W112-W108*W110),(((W109-W110)*(W112-W108*W110-W107)/(W112-W108*W110-W107+W113))*(W112-W110*W108-W107)/2+(W112+W112-W110*W108)*W110/2)-W105,\"HATALI\")))","v":12.689720780685235},null,null,null,null,null,null,null,null,"x'den bağımsız hesap        Mmax=",{"$f":"IF(AG108*AG110>AG112,(AG112*(IF(AG108*AG110>AG112,(AG112*AG110)/(AG110*AG108),IF(AND(AG108*AG110<AG112,AG107>AG112-AG108*AG110),AG110,IF(AND(AG108*AG110<AG112,AG107<AG112-AG108*AG110),((AG109-AG110)*(AG112-AG108*AG110-AG107)/(AG112-AG108*AG110-AG107+AG113))+AG110,\"HATALI\"))))/2)-AG105,IF(AND(AG108*AG110<AG112,AG107>AG112-AG108*AG110),(((AG112+AG112-AG110*AG108)/2)*AG110)-AG105,IF(AND(AG108*AG110<AG112,AG107<AG112-AG108*AG110),(((AG109-AG110)*(AG112-AG108*AG110-AG107)/(AG112-AG108*AG110-AG107+AG113))*(AG112-AG110*AG108-AG107)/2+(AG112+AG112-AG110*AG108)*AG110/2)-AG105,\"HATALI\")))","v":11.028128327665836},null,null,null,null,null,null,null,null,"x'den bağımsız hesap        Mmax=",{"$f":"IF(AQ108*AQ110>AQ112,(AQ112*(IF(AQ108*AQ110>AQ112,(AQ112*AQ110)/(AQ110*AQ108),IF(AND(AQ108*AQ110<AQ112,AQ107>AQ112-AQ108*AQ110),AQ110,IF(AND(AQ108*AQ110<AQ112,AQ107<AQ112-AQ108*AQ110),((AQ109-AQ110)*(AQ112-AQ108*AQ110-AQ107)/(AQ112-AQ108*AQ110-AQ107+AQ113))+AQ110,\"HATALI\"))))/2)-AQ105,IF(AND(AQ108*AQ110<AQ112,AQ107>AQ112-AQ108*AQ110),(((AQ112+AQ112-AQ110*AQ108)/2)*AQ110)-AQ105,IF(AND(AQ108*AQ110<AQ112,AQ107<AQ112-AQ108*AQ110),(((AQ109-AQ110)*(AQ112-AQ108*AQ110-AQ107)/(AQ112-AQ108*AQ110-AQ107+AQ113))*(AQ112-AQ110*AQ108-AQ107)/2+(AQ112+AQ112-AQ110*AQ108)*AQ110/2)-AQ105,\"HATALI\")))","v":11.694221503083735}]
[null,null,null,null,null,null,null,null,null,null,null,"durum",{"$f":"IF(M108*M110>M112,\"durum 1\",IF(AND(M108*M110<M112,M107>M112-M108*M110),\"durum 2\",IF(AND(M108*M110<M112,M107<M112-M108*M110),\"durum 3\",\"HATALI\")))","v":"durum 3"},null,null,null,null,null,null,null,null,"durum",{"$f":"IF(W108*W110>W112,\"durum 1\",IF(AND(W108*W110<W112,W107>W112-W108*W110),\"durum 2\",IF(AND(W108*W110<W112,W107<W112-W108*W110),\"durum 3\",\"HATALI\")))","v":"durum 3"},null,null,null,null,null,null,null,null,"durum",{"$f":"IF(AG108*AG110>AG112,\"durum 1\",IF(AND(AG108*AG110<AG112,AG107>AG112-AG108*AG110),\"durum 2\",IF(AND(AG108*AG110<AG112,AG107<AG112-AG108*AG110),\"durum 3\",\"HATALI\")))","v":"durum 2"},null,null,null,null,null,null,null,null,"durum",{"$f":"IF(AQ108*AQ110>AQ112,\"durum 1\",IF(AND(AQ108*AQ110<AQ112,AQ107>AQ112-AQ108*AQ110),\"durum 2\",IF(AND(AQ108*AQ110<AQ112,AQ107<AQ112-AQ108*AQ110),\"durum 3\",\"HATALI\")))","v":"durum 1"}]
[null,null,null,null,null,null,null,null,null,null,null,"sol mesnet (kolon genişliği) s1=",{"$f":"+G38","v":0.5},null,null,null,null,null,null,null,null,"sol mesnet (kolon genişliği) s1=",{"$f":"+Q38","v":0.5},null,null,null,null,null,null,null,null,"sol mesnet (kolon genişliği) s1=",{"$f":"+AA38","v":0.5},null,null,null,null,null,null,null,null,"sol mesnet (kolon genişliği) s1=",{"$f":"+AK38","v":0.5}]
[null,null,null,null,null,null,null,null,null,null,null,"sağ mesnet (kolon genişliği) s2=",{"$f":"+Q38","v":0.5},null,null,null,null,null,null,null,null,"sağ mesnet (kolon genişliği) s2=",{"$f":"+AA38","v":0.5},null,null,null,null,null,null,null,null,"sağ mesnet (kolon genişliği) s2=",{"$f":"+AK38","v":0.5},null,null,null,null,null,null,null,null,"sağ mesnet (kolon genişliği) s2=",{"$f":"+AU38","v":0.5}]
[null,null,null,null,null,null,null,null,null,null,null,"kiriş d yüksekliği=",{"$f":"+H101","v":0.56999999999999995},null,null,null,null,null,null,null,null,"kiriş d yüksekliği=",{"$f":"+R101","v":0.66999999999999993},null,null,null,null,null,null,null,null,"kiriş d yüksekliği=",{"$f":"+AB101","v":0.66999999999999993},null,null,null,null,null,null,null,null,"kiriş d yüksekliği=",{"$f":"+AL101","v":0.66999999999999993}]
[null,null,null,null,null,null,null,null,null,null,null,"kiriş h yüksekliği=",{"$f":"+O46","v":0.6},null,null,null,null,null,null,null,null,"kiriş h yüksekliği=",{"$f":"+Y46","v":0.7},null,null,null,null,null,null,null,null,"kiriş h yüksekliği=",{"$f":"+AI46","v":0.7},null,null,null,null,null,null,null,null,"kiriş h yüksekliği=",{"$f":"+AS46","v":0.7}]
[null,null,null,null,null,null,null,null,null,null,null,"sol kolon yüzünden d mesafede kesme kuvveti",null,null,null,null,null,null,null,null,null,"sol kolon yüzünden d mesafede kesme kuvveti",null,null,null,null,null,null,null,null,null,"sol kolon yüzünden d mesafede kesme kuvveti",null,null,null,null,null,null,null,null,null,"sol kolon yüzünden d mesafede kesme kuvveti"]
[null,null,null,null,null,null,null,null,null,null,null,"durum 1 için",{"$f":"IF(M114>(M120+M118/2),M112-M108*(M118/2+M120),IF(AND(M114<(M120+M118/2),(M120+M118/2)<M110),M108*(M120+M118/2)-M112,IF((M120+M118/2)=M110,M113-M108*M111,M108*M110-M112+M107+(M120+M118/2-M110)*M108)))","v":24.567222788800262},null,null,null,null,null,null,null,null,"durum 1 için",{"$f":"IF(W114>(W120+W118/2),W112-W108*(W118/2+W120),IF(AND(W114<(W120+W118/2),(W120+W118/2)<W110),W108*(W120+W118/2)-W112,IF((W120+W118/2)=W110,W113-W108*W111,W108*W110-W112+W107+(W120+W118/2-W110)*W108)))","v":22.227838301835},null,null,null,null,null,null,null,null,"durum 1 için",{"$f":"IF(AG114>(AG120+AG118/2),AG112-AG108*(AG118/2+AG120),IF(AND(AG114<(AG120+AG118/2),(AG120+AG118/2)<AG110),AG108*(AG120+AG118/2)-AG112,IF((AG120+AG118/2)=AG110,AG113-AG108*AG111,AG108*AG110-AG112+AG107+(AG120+AG118/2-AG110)*AG108)))","v":15.184486107442609},null,null,null,null,null,null,null,null,"durum 1 için",{"$f":"IF(AQ114>(AQ120+AQ118/2),AQ112-AQ108*(AQ118/2+AQ120),IF(AND(AQ114<(AQ120+AQ118/2),(AQ120+AQ118/2)<AQ110),AQ108*(AQ120+AQ118/2)-AQ112,IF((AQ120+AQ118/2)=AQ110,AQ113-AQ108*AQ111,AQ108*AQ110-AQ112+AQ107+(AQ120+AQ118/2-AQ110)*AQ108)))","v":15.416459963126339}]
[null,null,null,null,null,null,null,null,null,null,null,"durum 2 için",{"$f":"IF(M120+M118/2<M110,M112-(M120+M118/2)*M108,IF((M118/2+M120)=M110,M112-M108*M110,IF(M120+M118/2>M110,M107-M112+M108*M110+(M120+M118/2-M110)*M108,0)))","v":24.567222788800262},null,null,null,null,null,null,null,null,"durum 2 için",{"$f":"IF(W120+W118/2<W110,W112-(W120+W118/2)*W108,IF((W118/2+W120)=W110,W112-W108*W110,IF(W120+W118/2>W110,W107-W112+W108*W110+(W120+W118/2-W110)*W108,0)))","v":22.227838301835},null,null,null,null,null,null,null,null,"durum 2 için",{"$f":"IF(AG120+AG118/2<AG110,AG112-(AG120+AG118/2)*AG108,IF((AG118/2+AG120)=AG110,AG112-AG108*AG110,IF(AG120+AG118/2>AG110,AG107-AG112+AG108*AG110+(AG120+AG118/2-AG110)*AG108,0)))","v":15.184486107442609},null,null,null,null,null,null,null,null,"durum 2 için",{"$f":"IF(AQ120+AQ118/2<AQ110,AQ112-(AQ120+AQ118/2)*AQ108,IF((AQ118/2+AQ120)=AQ110,AQ112-AQ108*AQ110,IF(AQ120+AQ118/2>AQ110,AQ107-AQ112+AQ108*AQ110+(AQ120+AQ118/2-AQ110)*AQ108,0)))","v":15.416459963126339}]
[null,null,null,null,null,null,null,null,null,null,null,"durum 3 için",{"$f":"IF((M120+M118/2)<M110,M112-(M120+M118/2)*M108,IF(AND(M110<(M120+M118/2),(M120+M118/2)<M114),M112-M108*M110-M107-(M120+M118/2-M110)*M108,IF((M120+M118/2)>M114,(M120+M118/2-M114)*M108,IF((M120+M118/2)=M110,M112-M108*M110,0))))","v":24.567222788800262},null,null,null,null,null,null,null,null,"durum 3 için",{"$f":"IF((W120+W118/2)<W110,W112-(W120+W118/2)*W108,IF(AND(W110<(W120+W118/2),(W120+W118/2)<W114),W112-W108*W110-W107-(W120+W118/2-W110)*W108,IF((W120+W118/2)>W114,(W120+W118/2-W114)*W108,IF((W120+W118/2)=W110,W112-W108*W110,0))))","v":22.227838301835},null,null,null,null,null,null,null,null,"durum 3 için",{"$f":"IF((AG120+AG118/2)<AG110,AG112-(AG120+AG118/2)*AG108,IF(AND(AG110<(AG120+AG118/2),(AG120+AG118/2)<AG114),AG112-AG108*AG110-AG107-(AG120+AG118/2-AG110)*AG108,IF((AG120+AG118/2)>AG114,(AG120+AG118/2-AG114)*AG108,IF((AG120+AG118/2)=AG110,AG112-AG108*AG110,0))))","v":15.184486107442609},null,null,null,null,null,null,null,null,"durum 3 için",{"$f":"IF((AQ120+AQ118/2)<AQ110,AQ112-(AQ120+AQ118/2)*AQ108,IF(AND(AQ110<(AQ120+AQ118/2),(AQ120+AQ118/2)<AQ114),AQ112-AQ108*AQ110-AQ107-(AQ120+AQ118/2-AQ110)*AQ108,IF((AQ120+AQ118/2)>AQ114,(AQ120+AQ118/2-AQ114)*AQ108,IF((AQ120+AQ118/2)=AQ110,AQ112-AQ108*AQ110,0))))","v":15.416459963126339}]
[null,null,null,null,null,null,null,null,null,null,null,"sağ kolon yüzünden d mesafede kesme kuvveti",null,null,null,null,null,null,null,null,null,"sağ kolon yüzünden d mesafede kesme kuvveti",null,null,null,null,null,null,null,null,null,"sağ kolon yüzünden d mesafede kesme kuvveti",null,null,null,null,null,null,null,null,null,"sağ kolon yüzünden d mesafede kesme kuvveti"]
[null,null,null,null,null,null,null,null,null,null,null,"durum 1 için",{"$f":"IF((M120+M119/2)<M111,M113-(M120+M119/2)*M108,IF(AND((M120+M119/2)>M111,(M120+M119/2)<(M109-M114)),M113-M111*M108-M107-(M120+M119/2-M111)*M108,IF((M120+M119/2)=(M109-M110),M107+M108*M110-M112,((M120+M119/2)-(M109-M114))*M108)))","v":21.03277721119974},null,null,null,null,null,null,null,null,"durum 1 için",{"$f":"IF((W120+W119/2)<W111,W113-(W120+W119/2)*W108,IF(AND((W120+W119/2)>W111,(W120+W119/2)<(W109-W114)),W113-W111*W108-W107-(W120+W119/2-W111)*W108,IF((W120+W119/2)=(W109-W110),W107+W108*W110-W112,((W120+W119/2)-(W109-W114))*W108)))","v":16.372161698165002},null,null,null,null,null,null,null,null,"durum 1 için",{"$f":"IF((AG120+AG119/2)<AG111,AG113-(AG120+AG119/2)*AG108,IF(AND((AG120+AG119/2)>AG111,(AG120+AG119/2)<(AG109-AG114)),AG113-AG111*AG108-AG107-(AG120+AG119/2-AG111)*AG108,IF((AG120+AG119/2)=(AG109-AG110),AG107+AG108*AG110-AG112,((AG120+AG119/2)-(AG109-AG114))*AG108)))","v":17.115513892557395},null,null,null,null,null,null,null,null,"durum 1 için",{"$f":"IF((AQ120+AQ119/2)<AQ111,AQ113-(AQ120+AQ119/2)*AQ108,IF(AND((AQ120+AQ119/2)>AQ111,(AQ120+AQ119/2)<(AQ109-AQ114)),AQ113-AQ111*AQ108-AQ107-(AQ120+AQ119/2-AQ111)*AQ108,IF((AQ120+AQ119/2)=(AQ109-AQ110),AQ107+AQ108*AQ110-AQ112,((AQ120+AQ119/2)-(AQ109-AQ114))*AQ108)))","v":19.683540036873662}]
[null,null,null,null,null,null,null,null,null,null,null,"durum 2 için",{"$f":"IF((M120+M119/2)<M111,M113-(M120+M119/2)*M108,IF((M120+M119/2)=M111,M107-M112+M108*M110,IF((M120+M119/2)>M111,M112-(M109-(M120+M119/2))*M108,0)))","v":21.03277721119974},null,null,null,null,null,null,null,null,"durum 2 için",{"$f":"IF((W120+W119/2)<W111,W113-(W120+W119/2)*W108,IF((W120+W119/2)=W111,W107-W112+W108*W110,IF((W120+W119/2)>W111,W112-(W109-(W120+W119/2))*W108,0)))","v":16.372161698165002},null,null,null,null,null,null,null,null,"durum 2 için",{"$f":"IF((AG120+AG119/2)<AG111,AG113-(AG120+AG119/2)*AG108,IF((AG120+AG119/2)=AG111,AG107-AG112+AG108*AG110,IF((AG120+AG119/2)>AG111,AG112-(AG109-(AG120+AG119/2))*AG108,0)))","v":17.115513892557395},null,null,null,null,null,null,null,null,"durum 2 için",{"$f":"IF((AQ120+AQ119/2)<AQ111,AQ113-(AQ120+AQ119/2)*AQ108,IF((AQ120+AQ119/2)=AQ111,AQ107-AQ112+AQ108*AQ110,IF((AQ120+AQ119/2)>AQ111,AQ112-(AQ109-(AQ120+AQ119/2))*AQ108,0)))","v":19.683540036873662}]
[null,null,null,null,null,null,null,null,null,null,null,"durum 3 için",{"$f":"IF((M109-M114)>(M120+M119/2),M113-(M120+M119/2)*M108,IF(AND((M120+M119/2)>(M109-M114),(M109-M110)>(M120+M119/2)),((M120+M119/2)-(M109-M114))*M108,IF(M120+M119/2>(M109-M110),M112-(M109-(M120+M119/2))*M108,IF((M120+M119/2)=(M109-M110),M112-M108*M110-M107,0))))","v":21.03277721119974},null,null,null,null,null,null,null,null,"durum 3 için",{"$f":"IF((W109-W114)>(W120+W119/2),W113-(W120+W119/2)*W108,IF(AND((W120+W119/2)>(W109-W114),(W109-W110)>(W120+W119/2)),((W120+W119/2)-(W109-W114))*W108,IF(W120+W119/2>(W109-W110),W112-(W109-(W120+W119/2))*W108,IF((W120+W119/2)=(W109-W110),W112-W108*W110-W107,0))))","v":16.372161698165002},null,null,null,null,null,null,null,null,"durum 3 için",{"$f":"IF((AG109-AG114)>(AG120+AG119/2),AG113-(AG120+AG119/2)*AG108,IF(AND((AG120+AG119/2)>(AG109-AG114),(AG109-AG110)>(AG120+AG119/2)),((AG120+AG119/2)-(AG109-AG114))*AG108,IF(AG120+AG119/2>(AG109-AG110),AG112-(AG109-(AG120+AG119/2))*AG108,IF((AG120+AG119/2)=(AG109-AG110),AG112-AG108*AG110-AG107,0))))","v":17.115513892557395},null,null,null,null,null,null,null,null,"durum 3 için",{"$f":"IF((AQ109-AQ114)>(AQ120+AQ119/2),AQ113-(AQ120+AQ119/2)*AQ108,IF(AND((AQ120+AQ119/2)>(AQ109-AQ114),(AQ109-AQ110)>(AQ120+AQ119/2)),((AQ120+AQ119/2)-(AQ109-AQ114))*AQ108,IF(AQ120+AQ119/2>(AQ109-AQ110),AQ112-(AQ109-(AQ120+AQ119/2))*AQ108,IF((AQ120+AQ119/2)=(AQ109-AQ110),AQ112-AQ108*AQ110-AQ107,0))))","v":19.683540036873662}]
[null,null,null,null,null,null,null,null,null,null,null,"sol kolon yüzünden 2h mesafede kesme kuvveti",null,null,null,null,null,null,null,null,null,"sol kolon yüzünden 2h mesafede kesme kuvveti",null,null,null,null,null,null,null,null,null,"sol kolon yüzünden 2h mesafede kesme kuvveti",null,null,null,null,null,null,null,null,null,"sol kolon yüzünden 2h mesafede kesme kuvveti"]
[null,null,null,null,null,null,null,null,null,null,null,"durum 1 için",{"$f":"IF(M114>(M121*2+M118/2),M112-M108*(M118/2+M121*2),IF(AND(M114<(M121*2+M118/2),(M121*2+M118/2)<M110),M108*(M121*2+M118/2)-M112,IF((M121*2+M118/2)=M110,M113-M108*M111,M108*M110-M112+M107+(M121*2+M118/2-M110)*M108)))","v":18.267222788800261},null,null,null,null,null,null,null,null,"durum 1 için",{"$f":"IF(W114>(W121*2+W118/2),W112-W108*(W118/2+W121*2),IF(AND(W114<(W121*2+W118/2),(W121*2+W118/2)<W110),W108*(W121*2+W118/2)-W112,IF((W121*2+W118/2)=W110,W113-W108*W111,W108*W110-W112+W107+(W121*2+W118/2-W110)*W108)))","v":14.927838301834999},null,null,null,null,null,null,null,null,"durum 1 için",{"$f":"IF(AG114>(AG121*2+AG118/2),AG112-AG108*(AG118/2+AG121*2),IF(AND(AG114<(AG121*2+AG118/2),(AG121*2+AG118/2)<AG110),AG108*(AG121*2+AG118/2)-AG112,IF((AG121*2+AG118/2)=AG110,AG113-AG108*AG111,AG108*AG110-AG112+AG107+(AG121*2+AG118/2-AG110)*AG108)))","v":7.8844861074426085},null,null,null,null,null,null,null,null,"durum 1 için",{"$f":"IF(AQ114>(AQ121*2+AQ118/2),AQ112-AQ108*(AQ118/2+AQ121*2),IF(AND(AQ114<(AQ121*2+AQ118/2),(AQ121*2+AQ118/2)<AQ110),AQ108*(AQ121*2+AQ118/2)-AQ112,IF((AQ121*2+AQ118/2)=AQ110,AQ113-AQ108*AQ111,AQ108*AQ110-AQ112+AQ107+(AQ121*2+AQ118/2-AQ110)*AQ108)))","v":8.1164599631263386}]
[null,null,null,null,null,null,null,null,null,null,null,"durum 2 için",{"$f":"IF(M121*2+M118/2<M110,M112-(M121*2+M118/2)*M108,IF((M118/2+M121*2)=M110,M112-M108*M110,IF(M121*2+M118/2>M110,M107-M112+M108*M110+(M121*2+M118/2-M110)*M108,0)))","v":18.267222788800261},null,null,null,null,null,null,null,null,"durum 2 için",{"$f":"IF(W121*2+W118/2<W110,W112-(W121*2+W118/2)*W108,IF((W118/2+W121*2)=W110,W112-W108*W110,IF(W121*2+W118/2>W110,W107-W112+W108*W110+(W121*2+W118/2-W110)*W108,0)))","v":14.927838301834999},null,null,null,null,null,null,null,null,"durum 2 için",{"$f":"IF(AG121*2+AG118/2<AG110,AG112-(AG121*2+AG118/2)*AG108,IF((AG118/2+AG121*2)=AG110,AG112-AG108*AG110,IF(AG121*2+AG118/2>AG110,AG107-AG112+AG108*AG110+(AG121*2+AG118/2-AG110)*AG108,0)))","v":7.8844861074426085},null,null,null,null,null,null,null,null,"durum 2 için",{"$f":"IF(AQ121*2+AQ118/2<AQ110,AQ112-(AQ121*2+AQ118/2)*AQ108,IF((AQ118/2+AQ121*2)=AQ110,AQ112-AQ108*AQ110,IF(AQ121*2+AQ118/2>AQ110,AQ107-AQ112+AQ108*AQ110+(AQ121*2+AQ118/2-AQ110)*AQ108,0)))","v":8.1164599631263386}]
[null,null,null,null,null,null,null,null,null,null,null,"durum 3 için",{"$f":"IF((M121*2+M118/2)<M110,M112-(M121*2+M118/2)*M108,IF(AND(M110<(M121*2+M118/2),(M121*2+M118/2)<M114),M112-M108*M110-M107-(M121*2+M118/2-M110)*M108,IF((M121*2+M118/2)>M114,(M121*2+M118/2-M114)*M108,IF((M121*2+M118/2)=M110,M112-M108*M110,0))))","v":18.267222788800261},null,null,null,null,null,null,null,null,"durum 3 için",{"$f":"IF((W121*2+W118/2)<W110,W112-(W121*2+W118/2)*W108,IF(AND(W110<(W121*2+W118/2),(W121*2+W118/2)<W114),W112-W108*W110-W107-(W121*2+W118/2-W110)*W108,IF((W121*2+W118/2)>W114,(W121*2+W118/2-W114)*W108,IF((W121*2+W118/2)=W110,W112-W108*W110,0))))","v":14.927838301834999},null,null,null,null,null,null,null,null,"durum 3 için",{"$f":"IF((AG121*2+AG118/2)<AG110,AG112-(AG121*2+AG118/2)*AG108,IF(AND(AG110<(AG121*2+AG118/2),(AG121*2+AG118/2)<AG114),AG112-AG108*AG110-AG107-(AG121*2+AG118/2-AG110)*AG108,IF((AG121*2+AG118/2)>AG114,(AG121*2+AG118/2-AG114)*AG108,IF((AG121*2+AG118/2)=AG110,AG112-AG108*AG110,0))))","v":7.8844861074426085},null,null,null,null,null,null,null,null,"durum 3 için",{"$f":"IF((AQ121*2+AQ118/2)<AQ110,AQ112-(AQ121*2+AQ118/2)*AQ108,IF(AND(AQ110<(AQ121*2+AQ118/2),(AQ121*2+AQ118/2)<AQ114),AQ112-AQ108*AQ110-AQ107-(AQ121*2+AQ118/2-AQ110)*AQ108,IF((AQ121*2+AQ118/2)>AQ114,(AQ121*2+AQ118/2-AQ114)*AQ108,IF((AQ121*2+AQ118/2)=AQ110,AQ112-AQ108*AQ110,0))))","v":8.1164599631263386}]
[null,null,null,null,null,null,null,null,null,null,null,"sağ kolon yüzünden 2h mesafede kesme kuvveti",null,null,null,null,null,null,null,null,null,"sağ kolon yüzünden 2h mesafede kesme kuvveti",null,null,null,null,null,null,null,null,null,"sağ kolon yüzünden 2h mesafede kesme kuvveti",null,null,null,null,null,null,null,null,null,"sağ kolon yüzünden 2h mesafede kesme kuvveti"]
[null,null,null,null,null,null,null,null,null,null,null,"durum 1 için",{"$f":"IF((M121*2+M119/2)<M111,M113-(M121*2+M119/2)*M108,IF(AND((M121*2+M119/2)>M111,(M121*2+M119/2)<(M109-M114)),M113-M111*M108-M107-(M121*2+M119/2-M111)*M108,IF((M121*2+M119/2)=(M109-M110),M107+M108*M110-M112,((M121*2+M119/2)-(M109-M114))*M108)))","v":14.732777211199739},null,null,null,null,null,null,null,null,"durum 1 için",{"$f":"IF((W121*2+W119/2)<W111,W113-(W121*2+W119/2)*W108,IF(AND((W121*2+W119/2)>W111,(W121*2+W119/2)<(W109-W114)),W113-W111*W108-W107-(W121*2+W119/2-W111)*W108,IF((W121*2+W119/2)=(W109-W110),W107+W108*W110-W112,((W121*2+W119/2)-(W109-W114))*W108)))","v":9.0721616981650008},null,null,null,null,null,null,null,null,"durum 1 için",{"$f":"IF((AG121*2+AG119/2)<AG111,AG113-(AG121*2+AG119/2)*AG108,IF(AND((AG121*2+AG119/2)>AG111,(AG121*2+AG119/2)<(AG109-AG114)),AG113-AG111*AG108-AG107-(AG121*2+AG119/2-AG111)*AG108,IF((AG121*2+AG119/2)=(AG109-AG110),AG107+AG108*AG110-AG112,((AG121*2+AG119/2)-(AG109-AG114))*AG108)))","v":0.29999999999999805},null,null,null,null,null,null,null,null,"durum 1 için",{"$f":"IF((AQ121*2+AQ119/2)<AQ111,AQ113-(AQ121*2+AQ119/2)*AQ108,IF(AND((AQ121*2+AQ119/2)>AQ111,(AQ121*2+AQ119/2)<(AQ109-AQ114)),AQ113-AQ111*AQ108-AQ107-(AQ121*2+AQ119/2-AQ111)*AQ108,IF((AQ121*2+AQ119/2)=(AQ109-AQ110),AQ107+AQ108*AQ110-AQ112,((AQ121*2+AQ119/2)-(AQ109-AQ114))*AQ108)))","v":12.383540036873661}]
[null,null,null,null,null,null,null,null,null,null,null,"durum 2 için",{"$f":"IF((M121*2+M119/2)<M111,M113-(M121*2+M119/2)*M108,IF((M121*2+M119/2)=M111,M107-M112+M108*M110,IF((M121*2+M119/2)>M111,M112-(M109-(M121*2+M119/2))*M108,0)))","v":14.732777211199739},null,null,null,null,null,null,null,null,"durum 2 için",{"$f":"IF((W121*2+W119/2)<W111,W113-(W121*2+W119/2)*W108,IF((W121*2+W119/2)=W111,W107-W112+W108*W110,IF((W121*2+W119/2)>W111,W112-(W109-(W121*2+W119/2))*W108,0)))","v":9.0721616981650008},null,null,null,null,null,null,null,null,"durum 2 için",{"$f":"IF((AG121*2+AG119/2)<AG111,AG113-(AG121*2+AG119/2)*AG108,IF((AG121*2+AG119/2)=AG111,AG107-AG112+AG108*AG110,IF((AG121*2+AG119/2)>AG111,AG112-(AG109-(AG121*2+AG119/2))*AG108,0)))","v":2.1844861074426056},null,null,null,null,null,null,null,null,"durum 2 için",{"$f":"IF((AQ121*2+AQ119/2)<AQ111,AQ113-(AQ121*2+AQ119/2)*AQ108,IF((AQ121*2+AQ119/2)=AQ111,AQ107-AQ112+AQ108*AQ110,IF((AQ121*2+AQ119/2)>AQ111,AQ112-(AQ109-(AQ121*2+AQ119/2))*AQ108,0)))","v":12.383540036873661}]
[null,null,null,null,null,null,null,null,null,null,null,"durum 3 için",{"$f":"IF((M109-M114)>(M121*2+M119/2),M113-(M121*2+M119/2)*M108,IF(AND((M121*2+M119/2)>(M109-M114),(M109-M110)>(M121*2+M119/2)),((M121*2+M119/2)-(M109-M114))*M108,IF(M121*2+M119/2>(M109-M110),M112-(M109-(M121*2+M119/2))*M108,IF((M121*2+M119/2)=(M109-M110),M112-M108*M110,0))))","v":14.732777211199739},null,null,null,null,null,null,null,null,"durum 3 için",{"$f":"IF((W109-W114)>(W121*2+W119/2),W113-(W121*2+W119/2)*W108,IF(AND((W121*2+W119/2)>(W109-W114),(W109-W110)>(W121*2+W119/2)),((W121*2+W119/2)-(W109-W114))*W108,IF(W121*2+W119/2>(W109-W110),W112-(W109-(W121*2+W119/2))*W108,IF((W121*2+W119/2)=(W109-W110),W112-W108*W110,0))))","v":9.0721616981650008},null,null,null,null,null,null,null,null,"durum 3 için",{"$f":"IF((AG109-AG114)>(AG121*2+AG119/2),AG113-(AG121*2+AG119/2)*AG108,IF(AND((AG121*2+AG119/2)>(AG109-AG114),(AG109-AG110)>(AG121*2+AG119/2)),((AG121*2+AG119/2)-(AG109-AG114))*AG108,IF(AG121*2+AG119/2>(AG109-AG110),AG112-(AG109-(AG121*2+AG119/2))*AG108,IF((AG121*2+AG119/2)=(AG109-AG110),AG112-AG108*AG110,0))))","v":2.1844861074426056},null,null,null,null,null,null,null,null,"durum 3 için",{"$f":"IF((AQ109-AQ114)>(AQ121*2+AQ119/2),AQ113-(AQ121*2+AQ119/2)*AQ108,IF(AND((AQ121*2+AQ119/2)>(AQ109-AQ114),(AQ109-AQ110)>(AQ121*2+AQ119/2)),((AQ121*2+AQ119/2)-(AQ109-AQ114))*AQ108,IF(AQ121*2+AQ119/2>(AQ109-AQ110),AQ112-(AQ109-(AQ121*2+AQ119/2))*AQ108,IF((AQ121*2+AQ119/2)=(AQ109-AQ110),AQ112-AQ108*AQ110,0))))","v":12.383540036873661}]
[null,null,null,null,null,null,null,null,null,null,null,"sol kolon yüzünden d mesafede kesme kuvveti=",{"$f":"IF(M117=\"durum 1\",M123,IF(M117=\"durum 2\",M124,IF(M117=\"durum 3\",M125,\"hatalı\")))","v":24.567222788800262},null,null,null,null,null,null,null,null,"sol kolon yüzünden d mesafede kesme kuvveti=",{"$f":"IF(W117=\"durum 1\",W123,IF(W117=\"durum 2\",W124,IF(W117=\"durum 3\",W125,\"hatalı\")))","v":22.227838301835},null,null,null,null,null,null,null,null,"sol kolon yüzünden d mesafede kesme kuvveti=",{"$f":"IF(AG117=\"durum 1\",AG123,IF(AG117=\"durum 2\",AG124,IF(AG117=\"durum 3\",AG125,\"hatalı\")))","v":15.184486107442609},null,null,null,null,null,null,null,null,"sol kolon yüzünden d mesafede kesme kuvveti=",{"$f":"IF(AQ117=\"durum 1\",AQ123,IF(AQ117=\"durum 2\",AQ124,IF(AQ117=\"durum 3\",AQ125,\"hatalı\")))","v":15.416459963126339}]
[null,null,null,null,null,null,null,null,null,null,null,"sağ kolon yüzünden d mesafede kesme kuvveti=",{"$f":"IF(M117=\"durum 1\",M127,IF(M117=\"durum 2\",M128,IF(M117=\"durum 3\",M129,\"hatalı\")))","v":21.03277721119974},null,null,null,null,null,null,null,null,"sağ kolon yüzünden d mesafede kesme kuvveti=",{"$f":"IF(W117=\"durum 1\",W127,IF(W117=\"durum 2\",W128,IF(W117=\"durum 3\",W129,\"hatalı\")))","v":16.372161698165002},null,null,null,null,null,null,null,null,"sağ kolon yüzünden d mesafede kesme kuvveti=",{"$f":"IF(AG117=\"durum 1\",AG127,IF(AG117=\"durum 2\",AG128,IF(AG117=\"durum 3\",AG129,\"hatalı\")))","v":17.115513892557395},null,null,null,null,null,null,null,null,"sağ kolon yüzünden d mesafede kesme kuvveti=",{"$f":"IF(AQ117=\"durum 1\",AQ127,IF(AQ117=\"durum 2\",AQ128,IF(AQ117=\"durum 3\",AQ129,\"hatalı\")))","v":19.683540036873662}]
[null,null,null,null,null,null,null,null,null,null,null,"sol kolon yüzünden 2h mesafede kesme kuvveti=",{"$f":"IF(M117=\"durum 1\",M131,IF(M117=\"durum 2\",M132,IF(M117=\"durum 3\",M133,\"hatalı\")))","v":18.267222788800261},null,null,null,null,null,null,null,null,"sol kolon yüzünden 2h mesafede kesme kuvveti=",{"$f":"IF(W117=\"durum 1\",W131,IF(W117=\"durum 2\",W132,IF(W117=\"durum 3\",W133,\"hatalı\")))","v":14.927838301834999},null,null,null,null,null,null,null,null,"sol kolon yüzünden 2h mesafede kesme kuvveti=",{"$f":"IF(AG117=\"durum 1\",AG131,IF(AG117=\"durum 2\",AG132,IF(AG117=\"durum 3\",AG133,\"hatalı\")))","v":7.8844861074426085},null,null,null,null,null,null,null,null,"sol kolon yüzünden 2h mesafede kesme kuvveti=",{"$f":"IF(AQ117=\"durum 1\",AQ131,IF(AQ117=\"durum 2\",AQ132,IF(AQ117=\"durum 3\",AQ133,\"hatalı\")))","v":8.1164599631263386}]
[null,null,null,null,null,null,null,null,null,null,null,"sağ kolon yüzünden 2h mesafede kesme kuvveti=",{"$f":"IF(M117=\"durum 1\",M135,IF(M117=\"durum 2\",M136,IF(M117=\"durum 3\",M137,\"hatalı\")))","v":14.732777211199739},null,null,null,null,null,null,null,null,"sağ kolon yüzünden 2h mesafede kesme kuvveti=",{"$f":"IF(W117=\"durum 1\",W135,IF(W117=\"durum 2\",W136,IF(W117=\"durum 3\",W137,\"hatalı\")))","v":9.0721616981650008},null,null,null,null,null,null,null,null,"sağ kolon yüzünden 2h mesafede kesme kuvveti=",{"$f":"IF(AG117=\"durum 1\",AG135,IF(AG117=\"durum 2\",AG136,IF(AG117=\"durum 3\",AG137,\"hatalı\")))","v":2.1844861074426056},null,null,null,null,null,null,null,null,"sağ kolon yüzünden 2h mesafede kesme kuvveti=",{"$f":"IF(AQ117=\"durum 1\",AQ135,IF(AQ117=\"durum 2\",AQ136,IF(AQ117=\"durum 3\",AQ137,\"hatalı\")))","v":12.383540036873661}]
[null,"kiriş kolon yüzünden d mesafede kesme kuvveti (KN)",null,null,null,null,null,{"$f":"+M138","v":24.567222788800262},null,null,null,null,null,null,{"$f":"+M139","v":21.03277721119974},null,null,{"$f":"+W138","v":22.227838301835},null,null,null,null,null,null,{"$f":"+W139","v":16.372161698165002},null,null,{"$f":"+AG138","v":15.184486107442609},null,null,null,null,null,null,{"$f":"+AG139","v":17.115513892557395},null,null,{"$f":"+AQ138","v":15.416459963126339},null,null,null,null,null,null,{"$f":"+AQ139","v":19.683540036873662}]
[]
[]
[]
[]
[null,"kiriş kolon yüzünden 2*h mesafede kesme kuvveti (KN)",null,null,null,null,null,{"$f":"+M140","v":18.267222788800261},null,null,null,null,null,null,{"$f":"+M141","v":14.732777211199739},null,null,{"$f":"+W140","v":14.927838301834999},null,null,null,null,null,null,{"$f":"+W141","v":9.0721616981650008},null,null,{"$f":"+AG140","v":7.8844861074426085},null,null,null,null,null,null,{"$f":"+AG141","v":2.1844861074426056},null,null,{"$f":"+AQ140","v":8.1164599631263386},null,null,null,null,null,null,{"$f":"+AQ141","v":12.383540036873661}]
[]
[]
[]
[]
[null,"kiriş kolon yüzü kesme kuvveti (KN)",null,null,null,null,null,{"$f":"+M112-L19*G38/2","v":30.267222788800261},null,null,null,null,null,null,{"$f":"+M113-Q38/2*L19","v":26.732777211199739},null,null,{"$f":"+W112-V19*Q38/2","v":28.927838301834999},null,null,null,null,null,null,{"$f":"+W113-AA38/2*V19","v":23.072161698165001},null,null,{"$f":"+AG112-AF19*AA38/2","v":21.884486107442608},null,null,null,null,null,null,{"$f":"+AG113-AK38/2*AF19","v":23.815513892557394},null,null,{"$f":"+AQ112-AP19*AK38/2","v":22.116459963126339},null,null,null,null,null,null,{"$f":"+AQ113-AU38/2*AP19","v":26.383540036873661}]
[]
[]
[null,"kiriş kolon yüzü moment (KNm)",null,null,null,null,null,{"$f":"+M105-(M112+H152)/2*G38/2","v":19.86480232767444},null,null,null,null,null,null,{"$f":"+M106-(O152+M113)/2*Q38/2","v":19.712299778073252},null,null,{"$f":"+W105-(W112+R152)/2*Q38/2","v":18.437864697968362},null,null,null,null,null,null,{"$f":"+W106-(Y152+W113)/2*AA38/2","v":13.92651149062835},null,null,{"$f":"+AG105-(AG112+AB152)/2*AA38/2","v":12.740843887219381},null,null,null,null,null,null,{"$f":"+AG106-(AI152+AG113)/2*AK38/2","v":12.214625705137806},null,null,{"$f":"+AQ105-(AQ112+AL152)/2*AK38/2","v":12.76266856194478},null,null,null,null,null,null,{"$f":"+AQ106-(AS152+AQ113)/2*AU38/2","v":15.450089696533633}]

{"sheet":"5_aciklikli","index":4,"n_rows":155,"n_cols":64,"rows_kept":155,"cut":false,"hidden":false,"merged":[[121,51,121,52],[125,51,125,52],[129,51,129,52],[133,51,133,52],[129,11,129,12],[129,21,129,22],[129,31,129,32],[129,41,129,42],[133,11,133,12],[133,21,133,22],[133,31,133,32],[133,41,133,42],[121,11,121,12],[121,21,121,22],[121,31,121,32],[121,41,121,42],[125,11,125,12],[125,21,125,22],[125,31,125,32],[125,41,125,42],[10,58,10,59],[12,53,12,54],[12,38,12,39],[12,33,12,34],[12,18,12,19],[16,59,16,60],[29,8,29,9],[29,14,29,15],[29,18,29,19],[29,24,29,25],[29,28,29,29],[29,34,29,35],[29,38,29,39],[29,44,29,45],[29,48,29,49],[16,10,16,11],[16,20,16,21],[16,30,16,31],[16,40,16,41],[16,50,16,51],[29,58,29,59],[28,58,28,59],[28,38,28,39],[28,44,28,45],[16,3,16,4],[33,18,33,19],[33,28,33,29],[33,38,33,39],[33,48,33,49],[33,57,33,58],[33,60,33,61],[154,44,156,46],[154,47,156,49],[154,50,156,53],[154,54,156,56],[33,2,33,3],[33,5,33,6],[33,8,33,9],[33,13,33,14],[33,23,33,24],[33,33,33,34],[154,24,156,26],[154,27,156,29],[154,30,156,33],[154,34,156,36],[154,37,156,39],[154,40,156,43],[151,44,153,46],[154,1,156,6],[154,7,156,9],[154,10,156,13],[154,14,156,16],[154,17,156,19],[154,20,156,23],[151,24,153,26],[151,27,153,29],[151,30,153,33],[146,50,150,53],[146,54,150,56],[151,1,153,6],[151,7,153,9],[151,10,153,13],[151,14,153,16],[151,17,153,19],[151,20,153,23],[146,24,150,26],[146,27,150,29],[146,30,150,33],[146,34,150,36],[146,37,150,39],[146,40,150,43],[151,47,153,49],[151,50,153,53],[151,54,153,56],[151,34,153,36],[151,37,153,39],[151,40,153,43],[141,44,145,46],[141,47,145,49],[141,50,145,53],[141,54,145,56],[146,1,150,6],[146,7,150,9],[146,10,150,13],[146,14,150,16],[146,17,150,19],[146,20,150,23],[141,24,145,26],[141,27,145,29],[141,30,145,33],[141,34,145,36],[141,37,145,39],[141,40,145,43],[141,1,145,6],[141,7,145,9],[141,10,145,13],[141,14,145,16],[141,17,145,19],[141,20,145,23],[146,44,150,46],[146,47,150,49],[98,59,98,60],[100,1,103,6],[100,7,103,16],[100,17,103,26],[100,27,103,36],[100,37,103,46],[100,47,103,56],[98,29,98,30],[98,33,98,34],[98,39,98,40],[98,43,98,44],[98,49,98,50],[98,53,98,54],[90,8,90,9],[90,18,90,19],[90,28,90,29],[90,38,90,39],[90,48,90,49],[98,3,98,4],[98,9,98,10],[98,13,98,14],[98,19,98,20],[98,23,98,24],[85,29,85,30],[88,15,88,16],[88,25,88,26],[88,35,88,36],[88,45,88,46],[88,55,88,56],[89,5,89,6],[86,33,86,34],[86,39,86,40],[86,43,86,44],[86,49,86,50],[86,53,86,54],[83,7,83,8],[83,17,83,18],[83,27,83,28],[83,37,83,38],[83,47,83,48],[83,57,83,58],[86,59,86,60],[86,3,86,4],[86,9,86,10],[86,13,86,14],[86,19,86,20],[86,23,86,24],[86,29,86,30],[85,33,85,34],[85,39,85,40],[85,43,85,44],[85,49,85,50],[85,53,85,54],[85,59,85,60],[85,3,85,4],[85,9,85,10],[85,13,85,14],[85,19,85,20],[85,23,85,24],[73,59,73,60],[76,3,76,4],[76,9,76,10],[76,13,76,14],[76,19,76,20],[76,23,76,24],[76,29,76,30],[76,33,76,34],[76,39,76,40],[76,43,76,44],[73,29,73,30],[73,33,73,34],[73,39,73,40],[73,43,73,44],[73,49,73,50],[73,53,73,54],[76,49,76,50],[76,53,76,54],[76,59,76,60],[64,11,64,12],[64,21,64,22],[64,31,64,32],[64,41,64,42],[64,51,64,52],[73,3,73,4],[73,9,73,10],[73,13,73,14],[73,19,73,20],[73,23,73,24],[61,34,61,35],[61,38,61,39],[61,44,61,45],[61,48,61,49],[61,54,61,55],[61,58,61,59],[61,4,61,5],[61,8,61,9],[61,14,61,15],[61,18,61,19],[61,24,61,25],[61,28,61,29],[60,34,60,35],[60,38,60,39],[60,44,60,45],[60,48,60,49],[60,54,60,55],[60,58,60,59],[60,4,60,5],[60,8,60,9],[60,14,60,15],[60,18,60,19],[60,24,60,25],[60,28,60,29],[57,15,57,16],[58,5,58,6],[58,57,58,58],[55,17,55,18],[56,7,56,8],[56,25,56,26],[56,27,56,28],[56,35,56,36],[56,37,56,38],[51,59,51,60],[51,3,51,4],[51,9,51,10],[51,13,51,14],[51,19,51,20],[51,23,51,24],[51,29,51,30],[56,45,56,46],[56,47,56,48],[56,55,56,56],[45,54,47,54],[49,11,49,12],[49,21,49,22],[49,31,49,32],[49,41,49,42],[49,51,49,52],[51,33,51,34],[51,39,51,40],[51,43,51,44],[51,49,51,50],[51,53,51,54],[44,7,44,8],[44,17,44,18],[44,27,44,28],[44,37,44,38],[44,47,44,48],[45,14,47,14],[45,24,47,24],[45,34,47,34],[45,44,47,44],[39,38,40,38],[39,48,40,48],[39,58,40,58],[39,8,40,8],[39,18,40,18],[39,28,40,28],[42,11,42,12],[42,21,42,22],[42,31,42,32],[42,41,42,42],[42,51,42,52],[35,51,35,52],[35,58,35,59],[33,43,33,44],[33,53,33,54],[37,6,37,7],[37,16,37,17],[37,26,37,27],[37,36,37,37],[37,46,37,47],[37,56,37,57],[30,8,30,9],[30,14,30,15],[30,18,30,19],[30,24,30,25],[30,28,30,29],[30,34,30,35],[30,38,30,39],[30,44,30,45],[35,3,35,4],[35,11,35,12],[35,21,35,22],[35,31,35,32],[35,41,35,42],[30,48,30,49],[30,54,30,55],[29,54,29,55],[28,18,28,19],[28,24,28,25],[28,26,29,26],[28,28,28,29],[28,34,28,35],[28,36,29,36],[27,58,27,59],[28,4,28,5],[28,6,29,6],[28,8,28,9],[28,14,28,15],[28,16,29,16],[28,46,29,46],[28,48,28,49],[28,54,28,55],[28,56,29,56],[29,4,29,5],[24,63,26,63],[26,48,26,49],[26,54,26,55],[26,58,26,59],[27,4,27,5],[27,8,27,9],[27,14,27,15],[27,18,27,19],[27,24,27,25],[27,28,27,29],[27,34,27,35],[25,46,27,46],[25,48,25,49],[25,54,25,55],[25,56,27,56],[25,58,25,59],[26,4,26,5],[26,8,26,9],[26,14,26,15],[26,18,26,19],[26,24,26,25],[25,26,27,26],[25,28,25,29],[25,34,25,35],[25,4,25,5],[25,6,27,6],[25,8,25,9],[25,14,25,15],[25,16,27,16],[25,18,25,19],[25,24,25,25],[23,54,23,55],[23,56,24,56],[25,38,25,39],[25,44,25,45],[26,28,26,29],[26,34,26,35],[26,38,26,39],[26,44,26,45],[24,54,24,55],[25,36,27,36],[27,38,27,39],[27,44,27,45],[27,48,27,49],[27,54,27,55],[23,24,23,25],[23,26,24,26],[23,28,23,29],[23,58,23,59],[24,4,24,5],[24,8,24,9],[24,14,24,15],[24,18,24,19],[24,24,24,25],[24,28,24,29],[24,34,24,35],[23,34,23,35],[23,36,24,36],[23,38,23,39],[23,44,23,45],[23,46,24,46],[23,48,23,49],[24,38,24,39],[24,44,24,45],[24,48,24,49],[24,58,24,59],[23,4,23,5],[23,6,24,6],[23,8,23,9],[23,14,23,15],[23,16,24,16],[23,18,23,19],[21,58,21,59],[22,4,22,5],[22,8,22,9],[22,14,22,15],[22,18,22,19],[22,24,22,25],[22,28,22,29],[22,34,22,35],[22,38,22,39],[22,44,22,45],[22,58,22,59],[20,54,20,55],[20,56,22,56],[21,48,21,49],[21,54,21,55],[22,48,22,49],[22,54,22,55],[20,18,20,19],[20,24,20,25],[20,26,22,26],[20,28,20,29],[21,18,21,19],[21,24,21,25],[21,28,21,29],[21,34,21,35],[21,38,21,39],[21,44,21,45],[20,38,20,39],[20,44,20,45],[20,46,22,46],[19,51,19,52],[19,55,19,56],[19,57,19,58],[20,4,20,5],[20,6,22,6],[20,8,20,9],[20,14,20,15],[20,16,22,16],[19,25,19,26],[19,27,19,28],[19,31,19,32],[19,35,19,36],[19,37,19,38],[19,41,19,42],[19,5,19,6],[19,7,19,8],[19,11,19,12],[19,15,19,16],[19,17,19,18],[19,21,19,22],[20,58,20,59],[21,4,21,5],[21,8,21,9],[21,14,21,15],[16,36,18,36],[16,38,16,39],[16,43,16,44],[16,46,18,46],[16,48,16,49],[20,34,20,35],[20,36,22,36],[19,45,19,46],[19,47,19,48],[20,48,20,49],[13,58,13,59],[14,3,14,4],[16,6,18,6],[16,8,16,9],[16,13,16,14],[16,16,18,16],[16,18,16,19],[16,23,16,24],[16,26,18,26],[16,28,16,29],[13,43,13,44],[13,48,13,49],[13,53,13,54],[16,53,16,54],[16,56,18,56],[14,58,14,59],[18,2,18,3],[18,11,18,12],[18,21,18,22],[18,31,18,32],[18,41,18,42],[18,51,18,52],[18,59,18,60],[16,33,16,34],[14,48,14,49],[14,53,14,54],[14,56,15,56],[15,48,15,49],[15,53,15,54],[14,18,14,19],[14,23,14,24],[14,26,15,26],[14,28,14,29],[14,33,14,34],[14,36,15,36],[11,58,11,59],[13,63,15,63],[12,3,12,4],[14,6,15,6],[14,8,14,9],[14,13,14,14],[14,16,15,16],[12,48,12,49],[11,53,11,54],[12,43,12,44],[13,38,13,39],[12,58,12,59],[13,3,13,4],[15,8,15,9],[15,13,15,14],[15,18,15,19],[15,23,15,24],[15,28,15,29],[15,33,15,34],[15,38,15,39],[15,43,15,44],[14,38,14,39],[14,43,14,44],[14,46,15,46],[9,58,9,59],[11,3,11,4],[13,8,13,9],[13,13,13,14],[13,18,13,19],[13,23,13,24],[13,28,13,29],[13,33,13,34],[11,48,11,49],[11,56,13,56],[10,3,10,4],[12,8,12,9],[11,13,11,14],[11,18,11,19],[12,23,12,24],[12,28,12,29],[11,23,11,24],[11,26,13,26],[11,28,11,29],[11,36,13,36],[11,43,11,44],[11,46,13,46],[11,33,11,34],[11,38,11,39],[9,3,9,4],[11,6,13,6],[11,8,11,9],[11,16,13,16],[12,13,12,14],[9,43,9,44],[9,46,10,46],[9,48,9,49],[9,53,9,54],[9,6,10,6],[9,8,9,9],[9,13,9,14],[9,16,10,16],[9,18,9,19],[10,8,10,9],[10,13,10,14],[10,18,10,19],[9,56,10,56],[10,43,10,44],[10,48,10,49],[10,53,10,54],[9,23,9,24],[9,26,10,26],[9,28,9,29],[9,33,9,34],[9,36,10,36],[9,38,9,39],[10,23,10,24],[10,28,10,29],[10,33,10,34],[10,38,10,39],[5,38,6,38],[5,48,6,48],[5,58,6,58],[5,8,6,8],[5,18,6,18],[5,28,6,28],[1,1,1,65],[2,13,2,14],[3,6,3,7],[3,16,3,17],[3,26,3,27],[3,36,3,37],[3,46,3,47],[3,56,3,57]]}
[]
[null,"SAPLAMA KİRİŞLİ ÇERÇEVE CROSS (5 AÇIKLIKLI)\n(inş.müh. Gürcan BERBEROĞLU tel: 0532 366 02 04   www.betoncelik.com )"]
[null,null,null,null,null,null,null,null,"pas payı  d ' =",null,null,null,null,0.03,null,"m",null,null,null,null,null,"dikkat sadece sarı hücrelere rakam giriniz."]
[null,null,null,null,null,null,0.5,null,"m",null,null,null,null,null,null,null,0.5,null,"m",null,null,null,null,null,null,null,0.5,null,"m",null,null,null,null,null,null,null,0.5,null,"m",null,null,null,null,null,null,null,0.5,null,"m",null,null,null,null,null,null,null,0.5,null,"m"]
[null,null,null,null,null,null,null,null,"m",null,null,null,null,null,null,null,null,null,"m",null,null,null,null,null,null,null,null,null,"m",null,null,null,null,null,null,null,null,null,"m",null,null,null,null,null,null,null,null,null,"m",null,null,null,null,null,null,null,null,null,"m"]
[null,null,null,null,null,null,null,null,0.6,null,null,null,null,null,null,null,null,null,0.6,null,null,null,null,null,null,null,null,null,0.6,null,null,null,null,null,null,null,null,null,0.6,null,null,null,null,null,null,null,null,null,0.6,null,null,null,null,null,null,null,null,null,0.6]
[]
[]
[]
[null,null,null,{"$f":"SUM(D11:E15)","v":-3.7234423207822727},null,null,"dm4",null,null,null,null,null,null,null,null,null,"dm4",null,null,null,null,null,null,null,null,null,"dm4",null,null,null,null,null,null,null,null,null,"dm4",null,null,null,null,null,null,null,null,null,"dm4",null,null,null,null,null,null,null,null,null,"dm4",null,{"$f":"SUM(BG11:BH15)","v":10.046793775378683}]
[null,null,null,{"$f":"-I29*G21","v":-4.946691864047294E-5}]
[null,null,null,{"$f":"-I27*G21","v":2.423311746324088E-4},null,null,{"$f":"I6*G4^3/12*10000","v":62.499999999999993},null,{"$f":"SUM(I13:J17)","v":-3.7234423207822727},null,null,null,null,{"$f":"SUM(N13:O17)","v":-0.96667927032210765},null,null,{"$f":"S6*Q4^3/12*10000","v":62.499999999999993},null,{"$f":"SUM(S13:T17)","v":-0.96667927032210765},null,null,null,null,{"$f":"SUM(X13:Y17)","v":4.6764205385191673},null,null,{"$f":"AC6*AA4^3/12*10000","v":62.499999999999993},null,{"$f":"SUM(AC13:AD17)","v":4.6764205385191673},null,null,null,null,{"$f":"SUM(AH13:AI17)","v":-0.83378803708468086},null,null,{"$f":"AM6*AK4^3/12*10000","v":62.499999999999993},null,{"$f":"SUM(AM13:AN17)","v":-0.83378803708468086},null,null,null,null,{"$f":"SUM(AR13:AS17)","v":-5.399661011477451},null,null,{"$f":"AW6*AU4^3/12*10000","v":62.499999999999993},null,{"$f":"SUM(AW13:AX17)","v":-5.399661011477451},null,null,null,null,{"$f":"SUM(BB13:BC17)","v":10.046793775378683},null,null,{"$f":"BG6*BE4^3/12*10000","v":62.499999999999993},null,{"$f":"-BC28*BE17","v":6.7557664393630055E-4}]
[null,null,null,{"$f":"-I25*G21","v":1.7112889217857551E-2},null,null,null,null,{"$f":"-I29*G17","v":-4.946691864047294E-5},null,null,null,null,null,null,null,null,null,null,null,null,null,null,{"$f":"-(Y29+AC29)*AA21","v":-1.9479696159825378E-4},null,null,null,null,{"$f":"-(Y29+AC29)*AA17","v":-1.9479696159825378E-4},null,null,null,null,null,null,null,null,null,null,null,null,null,null,{"$f":"-(AS29+AW29)*AU21","v":-2.3446564171039784E-4},null,null,null,null,{"$f":"-(AS29+AW29)*AU17","v":-2.3446564171039784E-4},null,null,null,null,null,null,null,null,null,{"$f":"-BC26*BE17","v":1.099318093985055E-2},null,null,null,null,"m"]
[null,null,null,{"$f":"-I23*G21","v":0.20651699144752814},null,null,null,null,{"$f":"-I27*G17","v":2.423311746324088E-4},null,null,null,null,{"$f":"-(O28+S28)*Q21","v":2.1364515404032213E-4},null,null,null,null,{"$f":"-(O28+S28)*Q17","v":2.1364515404032213E-4},null,null,null,null,{"$f":"-(Y27+AC27)*AA21","v":-1.9806955582539433E-3},null,null,null,null,{"$f":"-(Y27+AC27)*AA17","v":-1.9806955582539433E-3},null,null,null,null,{"$f":"-(AI28+AM28)*AK21","v":8.4357193386679194E-4},null,null,null,null,{"$f":"-(AI28+AM28)*AK17","v":8.4357193386679194E-4},null,null,null,null,{"$f":"-(AS27+AW27)*AU21","v":-3.2659215002109553E-3},null,null,null,null,{"$f":"-(AS27+AW27)*AU17","v":-3.2659215002109553E-3},null,null,null,null,{"$f":"-BC28*BE21","v":6.7557664393630055E-4},null,null,null,null,{"$f":"-BC24*BE17","v":0.24484461573059607},null,null,null,null,3.8]
[null,null,null,{"$f":"-(E21+I21)*G21","v":-3.9472650657036503},null,null,"I =",null,{"$f":"-I25*G17","v":1.7112889217857551E-2},null,null,null,null,{"$f":"-(O26+S26)*Q21","v":-1.0466162549844684E-3},null,null,"I =",null,{"$f":"-(O26+S26)*Q17","v":-1.0466162549844684E-3},null,null,null,null,{"$f":"-(Y25+AC25)*AA21","v":-1.4696908584885631E-2},null,null,"I =",null,{"$f":"-(Y25+AC25)*AA17","v":-1.4696908584885631E-2},null,null,null,null,{"$f":"-(AI26+AM26)*AK21","v":1.0455166458011315E-2},null,null,"I =",null,{"$f":"-(AI26+AM26)*AK17","v":1.0455166458011315E-2},null,null,null,null,{"$f":"-(AS25+AW25)*AU21","v":-5.3144030820805641E-2},null,null,"I =",null,{"$f":"-(AS25+AW25)*AU17","v":-5.3144030820805641E-2},null,null,null,null,{"$f":"-BC26*BE21","v":1.099318093985055E-2},null,null,"I =",null,{"$f":"-(BC21+BG21+BC22)*BE17","v":9.7902804020643011}]
[null,null,null,null,null,null,null,null,{"$f":"-I23*G17","v":0.20651699144752814},null,null,null,null,{"$f":"-(O24+S24)*Q21","v":-7.3909714886360445E-2},null,null,null,null,{"$f":"-(O24+S24)*Q17","v":-7.3909714886360445E-2},null,null,null,null,{"$f":"-(Y23+AC23)*AA21","v":0.29807993683144651},null,null,null,null,{"$f":"-(Y23+AC23)*AA17","v":0.29807993683144651},null,null,null,null,{"$f":"-(AI24+AM24)*AK21","v":0.11616196477554724},null,null,null,null,{"$f":"-(AI24+AM24)*AK17","v":0.11616196477554724},null,null,null,null,{"$f":"-(AS23+AW23)*AU21","v":-1.1836455595419322},null,null,null,null,{"$f":"-(AS23+AW23)*AU17","v":-1.1836455595419322},null,null,null,null,{"$f":"-BC24*BE21","v":0.24484461573059607}]
[null,null,null,12,null,"KN",{"$f":"(4*G12/BL14)/((4*G12/BL14)+(4*L20/L36)+(4*G26/BL25))","v":0.26846224824206943},null,{"$f":"-(E21+I21)*G17","v":-3.9472650657036503},null,12,null,"KN",{"$f":"-(O21+O22+S21+S22)*Q21","v":-0.89193658433480305},null,null,{"$f":"(4*Q12/BL14)/((4*Q12/BL14)+(4*V20/V36)+(4*Q26/BL25)+(4*L20/L36))","v":0.1992584633187309},null,{"$f":"-(O21+O22+S21+S22)*Q17","v":-0.89193658433480305},null,12,null,"KN",{"$f":"-(Y21+AC21)*AA21","v":4.3952130027924587},null,null,{"$f":"(4*AA12/BL14)/((4*AA12/BL14)+(4*AA26/BL25)+(4*V20/V36)+(4*AF20/AF36))","v":0.18144074318128409},null,{"$f":"-(Y21+AC21)*AA17","v":4.3952130027924587},null,12,null,"KN",{"$f":"-(AI21+AM21+AI22+AM22)*AK21","v":-0.96124874025210616},null,null,{"$f":"(4*AK12/BL14)/((4*AK12/BL14)+(4*AK26/BL25)+(4*AF20/AF36)+(4*AP20/AP36))","v":0.16827450432919552},null,{"$f":"-(AI21+AM21+AI22+AM22)*AK17","v":-0.96124874025210616},null,12,null,"KN",{"$f":"-(AS21+AW21)*AU21","v":-4.1593710339727918},null,null,{"$f":"(4*AU12/BL14)/((4*AU12/BL14)+(4*AU26/BL25)+(4*AP20/AP36)+(4*AZ20/AZ36))","v":0.19469588110047095},null,{"$f":"-(AS21+AW21)*AU17","v":-4.1593710339727918},null,12,null,"KN",{"$f":"-(BC21+BG21+BC22)*BE21","v":9.7902804020643011},null,null,{"$f":"(4*BE12/BL14)/((4*BE12/BL14)+(4*BE26/BL25)+(4*AZ20/AZ36))","v":0.29314363682878991},null,null,12,null,"KN"]
[]
[null,"q =",10,null,"KN/m",null,null,null,null,null,"q =",15,null,"KN/m",null,null,null,null,null,null,"q =",10,null,"KN/m",null,null,null,null,null,null,"q =",10,null,"KN/m",null,null,null,null,null,null,"q =",10,null,"KN/m",null,null,null,null,null,null,"q =",15,null,"KN/m",null,null,null,null,"q =",10,null,"KN/m"]
[null,null,null,null,null,0,null,{"$f":"(4*L20/L36)/((4*G12/BL14)+(4*L20/L36)+(4*G26/BL25))","v":0.46307550351586108},null,null,"I =",{"$f":"(L43*H45^3/12+H45*L43*(((H45*L43*H45/2+L50*(O46-H45)*((O46-H45)/2+H45))/(L43*H45+(O46-H45)*L50))-H45/2)^2+L50*(O46-H45)^3/12+L50*(O46-H45)*(O46-((H45*L43*H45/2+L50*(O46-H45)*((O46-H45)/2+H45))/(L43*H45+(O46-H45)*L50))-(O46-H45)/2)^2)*10000","v":127.66666666666663},null,"dm4",null,{"$f":"(4*L20/L36)/((4*Q12/BL14)+(4*V20/V36)+(4*Q26/BL25)+(4*L20/L36))","v":0.34370461335002184},null,{"$f":"(4*V20/V36)/((4*Q12/BL14)+(4*V20/V36)+(4*Q26/BL25)+(4*L20/L36))","v":0.25777846001251636},null,null,"I =",{"$f":"(V43*R45^3/12+R45*V43*(((R45*V43*R45/2+V50*(Y46-R45)*((Y46-R45)/2+R45))/(V43*R45+(Y46-R45)*V50))-R45/2)^2+V50*(Y46-R45)^3/12+V50*(Y46-R45)*(Y46-((R45*V43*R45/2+V50*(Y46-R45)*((Y46-R45)/2+R45))/(V43*R45+(Y46-R45)*V50))-(Y46-R45)/2)^2)*10000","v":127.66666666666663},null,"dm4",null,{"$f":"(4*V20/V36)/((4*AA12/BL14)+(4*AA26/BL25)+(4*V20/V36)+(4*AF20/AF36))","v":0.23472787344536961},null,{"$f":"(4*AF20/AF36)/((4*AA12/BL14)+(4*AA26/BL25)+(4*V20/V36)+(4*AF20/AF36))","v":0.40239064019206222},null,null,"I =",{"$f":"(AF43*AB45^3/12+AB45*AF43*(((AB45*AF43*AB45/2+AF50*(AI46-AB45)*((AI46-AB45)/2+AB45))/(AF43*AB45+(AI46-AB45)*AF50))-AB45/2)^2+AF50*(AI46-AB45)^3/12+AF50*(AI46-AB45)*(AI46-((AB45*AF43*AB45/2+AF50*(AI46-AB45)*((AI46-AB45)/2+AB45))/(AF43*AB45+(AI46-AB45)*AF50))-(AI46-AB45)/2)^2)*10000","v":127.66666666666663},null,"dm4",null,{"$f":"(4*AF20/AF36)/((4*AK12/BL14)+(4*AK26/BL25)+(4*AF20/AF36)+(4*AP20/AP36))","v":0.373191182629655},null,{"$f":"(4*AP20/AP36)/((4*AK12/BL14)+(4*AK26/BL25)+(4*AF20/AF36)+(4*AP20/AP36))","v":0.29025980871195389},null,null,"I =",{"$f":"(AP43*AL45^3/12+AL45*AP43*(((AL45*AP43*AL45/2+AP50*(AS46-AL45)*((AS46-AL45)/2+AL45))/(AP43*AL45+(AS46-AL45)*AP50))-AL45/2)^2+AP50*(AS46-AL45)^3/12+AP50*(AS46-AL45)*(AS46-((AL45*AP43*AL45/2+AP50*(AS46-AL45)*((AS46-AL45)/2+AL45))/(AP43*AL45+(AS46-AL45)*AP50))-(AS46-AL45)/2)^2)*10000","v":127.66666666666663},null,"dm4",null,{"$f":"(4*AP20/AP36)/((4*AU12/BL14)+(4*AU26/BL25)+(4*AP20/AP36)+(4*AZ20/AZ36))","v":0.33583453078948194},null,{"$f":"(4*AZ20/AZ36)/((4*AU12/BL14)+(4*AU26/BL25)+(4*AP20/AP36)+(4*AZ20/AZ36))","v":0.2747737070095761},null,null,"I =",{"$f":"(AZ43*AV45^3/12+AV45*AZ43*(((AV45*AZ43*AV45/2+AZ50*(BC46-AV45)*((BC46-AV45)/2+AV45))/(AZ43*AV45+(BC46-AV45)*AZ50))-AV45/2)^2+AZ50*(BC46-AV45)^3/12+AZ50*(BC46-AV45)*(BC46-((AV45*AZ43*AV45/2+AZ50*(BC46-AV45)*((BC46-AV45)/2+AV45))/(AZ43*AV45+(BC46-AV45)*AZ50))-(BC46-AV45)/2)^2)*10000","v":127.66666666666663},null,"dm4",null,{"$f":"(4*AZ20/AZ36)/((4*BE12/BL14)+(4*BE26/BL25)+(4*AZ20/AZ36))","v":0.41371272634242012},null,0]
[null,null,null,null,{"$f":"IF(OR(D36=0,D36=\"\"),0,-C19*D36*D36/2-D17*F34)","v":-15.599999999999998},null,{"$f":"(4*G26/BL25)/((4*G12/BL14)+(4*L20/L36)+(4*G26/BL25))","v":0.26846224824206943},null,{"$f":"L19*L36^2/12+K17*I34*N34^2/L36^2","v":30.30324074074074},null,null,null,null,null,{"$f":"-L19*L36^2/12-K17*N34*I34^2/L36^2","v":-33.155092592592595},null,{"$f":"(4*Q26/BL25)/((4*Q12/BL14)+(4*V20/V36)+(4*Q26/BL25)+(4*L20/L36))","v":0.1992584633187309},null,{"$f":"V19*V36^2/12+U17*S34*X34^2/V36^2","v":38.192708333333336},null,null,null,null,null,{"$f":"-V19*V36^2/12-U17*X34*S34^2/V36^2","v":-39.682291666666664},null,{"$f":"(4*AA26/BL25)/((4*AA12/BL14)+(4*AA26/BL25)+(4*V20/V36)+(4*AF20/AF36))","v":0.18144074318128409},null,{"$f":"AF19*AF36^2/12+AE17*AC34*AH34^2/AF36^2","v":15.458333333333334},null,null,null,null,null,{"$f":"-AF19*AF36^2/12-AE17*AH34*AC34^2/AF36^2","v":-15.458333333333334},null,{"$f":"(4*AK26/BL25)/((4*AK12/BL14)+(4*AK26/BL25)+(4*AF20/AF36)+(4*AP20/AP36))","v":0.16827450432919552},null,{"$f":"AP19*AP36^2/12+AO17*AM34*AR34^2/AP36^2","v":19.88425925925926},null,null,null,null,null,{"$f":"-AP19*AP36^2/12-AO17*AR34*AM34^2/AP36^2","v":-24.699074074074076},null,{"$f":"(4*AU26/BL25)/((4*AU12/BL14)+(4*AU26/BL25)+(4*AP20/AP36)+(4*AZ20/AZ36))","v":0.19469588110047095},null,{"$f":"AZ19*AZ36^2/12+AY17*AW34*BB34^2/AZ36^2","v":46.0625},null,null,null,null,null,{"$f":"-AZ19*AZ36^2/12-AY17*BB34*AW34^2/AZ36^2","v":-46.0625},null,{"$f":"(4*BE26/BL25)/((4*BE12/BL14)+(4*BE26/BL25)+(4*AZ20/AZ36))","v":0.29314363682878991},null,{"$f":"IF(OR(BG36=0,BG36=\"\"),0,BH19*BG36*BG36/2+BH17*BF34)","v":15.599999999999998}]
[null,null,null,null,null,null,null,null,{"$f":"-(E21+I21)*H20","v":-6.808710609333442},null,null,null,null,null,{"$f":"+I22/2","v":-3.404355304666721},null,null,null,{"$f":"+Y22/2","v":2.8430191130062861},null,null,null,null,null,{"$f":"-(Y21+AC21)*Z20","v":5.6860382260125721},null,null,null,{"$f":"-(Y21+AC21)*AB20","v":9.747494101735839},null,null,null,null,null,{"$f":"+AC22/2","v":4.8737470508679195},null,null,null,{"$f":"+AS22/2","v":-3.5872880609445934},null,null,null,null,null,{"$f":"-(AS21+AW21)*AT20","v":-7.1745761218891868},null,null,null,{"$f":"-(AS21+AW21)*AV20","v":-5.8701077360911516},null,null,null,null,null,{"$f":"+AW22/2","v":-2.9350538680455758}]
[null,null,null,null,null,null,null,null,{"$f":"+O23/2","v":-0.76925896583162801},null,null,null,null,null,{"$f":"-(O21+O22+S21+S22)*P20","v":-1.538517931663256},null,null,null,{"$f":"-(O21+O22+S21+S22)*R20","v":-1.1538884487474419},null,null,null,null,null,{"$f":"+S23/2","v":-0.57694422437372095},null,null,null,{"$f":"+AI23/2","v":-1.0659058411907922},null,null,null,null,null,{"$f":"-(AI21+AM21+AI22+AM22)*AJ20","v":-2.1318116823815845},null,null,null,{"$f":"-(AI21+AI22+AM21+AM22)*AL20","v":-1.6580757529634547},null,null,null,null,null,{"$f":"+AM23/2","v":-0.82903787648172733},null,null,null,{"$f":"+BC23/2","v":6.9084965319584875},null,null,null,null,null,{"$f":"-(BC21+BG21+BC22)*BD20","v":13.816993063916975}]
[null,null,null,null,null,null,"dm4",null,{"$f":"-I23*H20","v":0.35622498293657173},null,null,null,null,null,{"$f":"+I24/2","v":0.17811249146828587},null,"dm4",null,{"$f":"+Y24/2","v":0.1928113511397721},null,null,null,null,null,{"$f":"-(Y23+AC23)*Z20","v":0.3856227022795442},null,"dm4",null,{"$f":"-(Y23+AC23)*AB20","v":0.66106748962207584},null,null,null,null,null,{"$f":"+AC24/2","v":0.33053374481103792},null,"dm4",null,{"$f":"+AS24/2","v":-1.0208460725080462},null,null,null,null,null,{"$f":"-(AS23+AW23)*AT20","v":-2.0416921450160923},null,"dm4",null,{"$f":"-(AS23+AW23)*AV20","v":-1.6704753913768027},null,null,null,null,null,{"$f":"+AW24/2","v":-0.83523769568840134},null,"dm4",null,null,null,null,null,null,"m"]
[null,null,null,null,null,null,null,null,{"$f":"+O25/2","v":-6.3744117952953469E-2},null,null,null,null,null,{"$f":"-(O24+S24)*P20","v":-0.12748823590590694},null,null,null,{"$f":"-(O24+S24)*R20","v":-9.5616176929430197E-2},null,null,null,null,null,{"$f":"+S25/2","v":-4.7808088464715098E-2},null,null,null,{"$f":"+AI25/2","v":0.12880923697853822},null,null,null,null,null,{"$f":"-(AI24+AM24)*AJ20","v":0.25761847395707643},null,null,null,{"$f":"-(AI24+AM24)*AL20","v":0.20036992418883723},null,null,null,null,null,{"$f":"+AM25/2","v":0.10018496209441861},null,null,null,{"$f":"+BC25/2","v":0.17277423211360457},null,null,null,null,null,{"$f":"-BC24*BD20","v":0.34554846422720914},null,null,null,null,null,null,null,null,3.8]
[null,null,null,null,null,null,{"$f":"I40*G38^3/12*10000","v":62.499999999999993},null,{"$f":"-I25*H20","v":2.9518339517238368E-2},null,null,null,null,null,{"$f":"+I26/2","v":1.4759169758619184E-2},null,{"$f":"S40*Q38^3/12*10000","v":62.499999999999993},null,{"$f":"+Y26/2","v":-9.5066136686411309E-3},null,null,null,null,null,{"$f":"-(Y25+AC25)*Z20","v":-1.9013227337282262E-2},null,{"$f":"AC40*AA38^3/12*10000","v":62.499999999999993},null,{"$f":"-(Y25+AC25)*AB20","v":-3.2594104006769591E-2},null,null,null,null,null,{"$f":"+AC26/2","v":-1.6297052003384795E-2},null,{"$f":"AM40*AK38^3/12*10000","v":62.499999999999993},null,{"$f":"+AS26/2","v":-4.583456145576327E-2},null,null,null,null,null,{"$f":"-(AS25+AW25)*AT20","v":-9.166912291152654E-2},null,{"$f":"AW40*AU38^3/12*10000","v":62.499999999999993},null,{"$f":"-(AS25+AW25)*AV20","v":-7.5002009654885335E-2},null,null,null,null,null,{"$f":"+AW26/2","v":-3.7501004827442667E-2},null,{"$f":"BG40*BE38^3/12*10000","v":62.499999999999993}]
[null,null,null,null,null,null,null,null,{"$f":"+O27/2","v":-9.0266388000260459E-4},null,null,null,null,null,{"$f":"-(O26+S26)*P20","v":-1.8053277600052092E-3},null,null,null,{"$f":"-(O26+S26)*R20","v":-1.3539958200039068E-3},null,null,null,null,null,{"$f":"+S27/2","v":-6.7699791000195339E-4},null,null,null,{"$f":"+AI27/2","v":1.1593485152754029E-2},null,null,null,null,null,{"$f":"-(AI26+AM26)*AJ20","v":2.3186970305508058E-2},null,null,null,{"$f":"-(AI26+AM26)*AL20","v":1.8034310237617378E-2},null,null,null,null,null,{"$f":"+AM27/2","v":9.0171551188086892E-3},null,null,null,{"$f":"+BC27/2","v":7.7573214738707822E-3},null,null,null,null,null,{"$f":"-BC26*BD20","v":1.5514642947741564E-2}]
[null,null,null,null,null,null,null,null,{"$f":"-I27*H20","v":4.1800153073778693E-4},null,null,null,null,null,{"$f":"+I28/2","v":2.0900076536889346E-4},null,null,null,{"$f":"+Y28/2","v":-1.2812019179923506E-3},null,null,null,null,null,{"$f":"-(Y27+AC27)*Z20","v":-2.5624038359847012E-3},null,null,null,{"$f":"-(Y27+AC27)*AB20","v":-4.3926922902594884E-3},null,null,null,null,null,{"$f":"+AC28/2","v":-2.1963461451297442E-3},null,null,null,{"$f":"+AS28/2","v":-2.816724237870829E-3},null,null,null,null,null,{"$f":"-(AS27+AW27)*AT20","v":-5.633448475741658E-3},null,null,null,{"$f":"-(AS27+AW27)*AV20","v":-4.6091851165159011E-3},null,null,null,null,null,{"$f":"+AW28/2","v":-2.3045925582579506E-3}]
[null,null,null,null,null,null,"I =",null,{"$f":"+O29/2","v":1.8426024129794655E-4},null,null,null,null,null,{"$f":"-(O28+S28)*P20","v":3.685204825958931E-4},null,"I =",null,{"$f":"-(O28+S28)*R20","v":2.7639036194691981E-4},null,null,null,null,null,{"$f":"+S29/2","v":1.3819518097345991E-4},null,"I =",null,{"$f":"+AI29/2","v":9.3541683241884078E-4},null,null,null,null,null,{"$f":"-(AI28+AM28)*AJ20","v":1.8708336648376816E-3},null,"I =",null,{"$f":"-(AI28+AM28)*AL20","v":1.455092850429308E-3},null,null,null,null,null,{"$f":"+AM29/2","v":7.2754642521465399E-4},null,"I =",null,{"$f":"+BC29/2","v":4.7671963519267468E-4},null,null,null,null,null,{"$f":"-BC28*BD20","v":9.5343927038534935E-4},null,"I ="]
[null,null,null,null,null,null,null,null,{"$f":"-I29*H20","v":-8.5326404017000657E-5},null,null,null,null,null,null,null,null,null,null,null,null,null,null,null,{"$f":"-(Y29+AC29)*Z20","v":-2.5200666480897641E-4},null,null,null,{"$f":"-(Y29+AC29)*AB20","v":-4.320114253868168E-4},null,null,null,null,null,null,null,null,null,null,null,null,null,null,null,{"$f":"-(AS29+AW29)*AT20","v":-4.0443412734259319E-4},null,null,null,{"$f":"-(AS29+AW29)*AV20","v":-3.3090064964393979E-4}]
[null,null,null,null,null,null,null,null,{"$f":"SUM(I21:J30)","v":23.046884641564542},null,null,null,null,null,{"$f":"SUM(O21:P30)","v":-38.033810210113622},null,null,null,{"$f":"SUM(S21:T30)","v":39.967168750757828},null,null,null,null,null,{"$f":"SUM(Y21:Z30)","v":-34.257749491780089},null,null,null,{"$f":"SUM(AC21:AD30)","v":24.904908414741758},null,null,null,null,null,{"$f":"SUM(AI21:AJ30)","v":-12.121681340257053},null,null,null,{"$f":"SUM(AM21:AN30)","v":13.789257414426414},null,null,null,null,null,{"$f":"SUM(AS21:AT30)","v":-34.732157559337246},null,null,null,{"$f":"SUM(AW21:AX30)","v":45.53147958229215},null,null,null,null,null,{"$f":"SUM(BC21:BD30)","v":-35.693587550757371}]
[]
[]
[null,null,0.5,null,"m",{"$f":"+D36-C34","v":0.7},null,"m",2.75,null,"m",null,null,{"$f":"+L36-I34","v":1.75},null,"m",null,null,3.25,null,"m",null,null,{"$f":"+V36-S34","v":2.75},null,"m",null,null,1.75,null,"m",null,null,{"$f":"+AF36-AC34","v":1.75},null,"m",null,null,3.25,null,"m",null,null,{"$f":"+AP36-AM34","v":1.25},null,"m",null,null,2.75,null,"m",null,null,{"$f":"+AZ36-AW34","v":2.75},null,"m",null,{"$f":"+BG36-BI34","v":0.7},null,"m",0.5,null,"m"]
[]
[null,null,null,1.2,null,"m",null,null,null,null,null,4.5,null,"m",null,null,null,null,null,null,null,6,null,"m",null,null,null,null,null,null,null,3.5,null,"m",null,null,null,null,null,null,null,4.5,null,"m",null,null,null,null,null,null,null,5.5,null,"m",null,null,null,null,1.2,null,"m"]
[]
[null,null,null,null,null,null,0.5,null,"m",null,null,null,null,null,null,null,0.5,null,"m",null,null,null,null,null,null,null,0.5,null,"m",null,null,null,null,null,null,null,0.5,null,"m",null,null,null,null,null,null,null,0.5,null,"m",null,null,null,null,null,null,null,0.5,null,"m"]
[null,null,null,null,null,null,null,null,"m",null,null,null,null,null,null,null,null,null,"m",null,null,null,null,null,null,null,null,null,"m",null,null,null,null,null,null,null,null,null,"m",null,null,null,null,null,null,null,null,null,"m",null,null,null,null,null,null,null,null,null,"m"]
[null,null,null,null,null,null,null,null,0.6,null,null,null,null,null,null,null,null,null,0.6,null,null,null,null,null,null,null,null,null,0.6,null,null,null,null,null,null,null,null,null,0.6,null,null,null,null,null,null,null,null,null,0.6,null,null,null,null,null,null,null,null,null,0.6]
[]
[]
[null,null,null,null,null,null,null,null,null,null,null,1.2,null,"m",null,null,null,null,null,null,null,1.2,null,"m",null,null,null,null,null,null,null,1.2,null,"m",null,null,null,null,null,null,null,1.2,null,"m",null,null,null,null,null,null,null,1.2,null,"m"]
[]
[null,null,null,null,null,null,null,0.1,null,"m",null,null,null,null,"m",null,null,0.1,null,"m",null,null,null,null,"m",null,null,0.1,null,"m",null,null,null,null,"m",null,null,0.1,null,"m",null,null,null,null,"m",null,null,0.1,null,"m",null,null,null,null,"m"]
[null,null,null,null,null,null,null,null,null,null,null,null,null,null,0.7,null,null,null,null,null,null,null,null,null,0.7,null,null,null,null,null,null,null,null,null,0.7,null,null,null,null,null,null,null,null,null,0.7,null,null,null,null,null,null,null,null,null,0.7]
[]
[]
[]
[null,null,null,null,null,null,null,null,null,null,null,0.25,null,"m",null,null,null,null,null,null,null,0.25,null,"m",null,null,null,null,null,null,null,0.25,null,"m",null,null,null,null,null,null,null,0.25,null,"m",null,null,null,null,null,null,null,0.25,null,"m"]
[]
[null,null,null,{"$f":"IF(I12<0,I12/2,\"\")","v":-1.8617211603911363},null,null,null,null,null,{"$f":"IF(I12>0,I12/2,\"\")","v":""},null,null,null,{"$f":"IF(S12<0,S12/2,\"\")","v":-0.48333963516105383},null,null,null,null,null,{"$f":"IF(S12>0,S12/2,\"\")","v":""},null,null,null,{"$f":"IF(AC12<0,AC12/2,\"\")","v":""},null,null,null,null,null,{"$f":"IF(AC12>0,AC12/2,\"\")","v":2.3382102692595836},null,null,null,{"$f":"IF(AM12<0,AM12/2,\"\")","v":-0.41689401854234043},null,null,null,null,null,{"$f":"IF(AM12>0,AM12/2,\"\")","v":""},null,null,null,{"$f":"IF(AW12<0,AW12/2,\"\")","v":-2.6998305057387255},null,null,null,null,null,{"$f":"IF(AW12>0,AW12/2,\"\")","v":""},null,null,null,{"$f":"IF(BG10<0,BG10/2,\"\")","v":""},null,null,null,null,null,{"$f":"IF(BG10>0,BG10/2,\"\")","v":5.0233968876893416}]
[]
[]
[null,null,null,null,null,null,null,null,null,"moment diyagramı (KNm)"]
[null,null,null,null,null,null,null,null,null,null,null,null,null,null,null,null,null,{"$f":"-S31","v":-39.967168750757828}]
[null,null,null,null,null,null,null,{"$f":"-I31","v":-23.046884641564542},null,null,null,null,null,null,null,null,null,null,null,null,null,null,null,null,null,{"$f":"Y31","v":-34.257749491780089},null,{"$f":"-AC31","v":-24.904908414741758},null,null,null,null,null,null,null,{"$f":"AI31","v":-12.121681340257053},null,{"$f":"-+AM31","v":-13.789257414426414},null,null,null,null,null,null,null,{"$f":"AS31","v":-34.732157559337246},null,{"$f":"-AW31","v":-45.53147958229215},null,null,null,null,null,null,null,{"$f":"BC31","v":-35.693587550757371}]
[null,null,null,null,null,null,null,null,null,null,null,null,null,null,null,{"$f":"O31","v":-38.033810210113622}]
[null,null,null,null,null,{"$f":"IF(E21=0,\"\",+E21)","v":-15.599999999999998},null,null,null,null,null,null,null,null,null,null,null,null,null,null,null,null,null,null,null,null,null,null,null,null,null,null,null,null,null,null,null,null,null,null,null,null,null,null,null,null,null,null,null,null,null,null,null,null,null,null,null,{"$f":"IF(BG21=0,\"\",-BG21)","v":-15.599999999999998}]
[]
[null,null,null,null,{"$f":"IF(I12>0,-I12,\"\")","v":""},null,null,null,{"$f":"IF(I12<0,-I12,\"\")","v":3.7234423207822727},null,null,null,null,null,{"$f":"IF(S12>0,-S12,\"\")","v":""},null,null,null,{"$f":"IF(S12<0,-S12,\"\")","v":0.96667927032210765},null,null,null,null,null,{"$f":"IF(AC12>0,-AC12,\"\")","v":-4.6764205385191673},null,null,null,{"$f":"IF(AC12<0,-AC12,\"\")","v":""},null,null,null,null,null,{"$f":"IF(AM12>0,-AM12,\"\")","v":""},null,null,null,{"$f":"IF(AM12<0,-AM12,\"\")","v":0.83378803708468086},null,null,null,null,null,{"$f":"IF(AW12>0,-AW12,\"\")","v":""},null,null,null,{"$f":"IF(AW12<0,-AW12,\"\")","v":5.399661011477451},null,null,null,null,null,{"$f":"IF(BG10>0,-BG10,\"\")","v":-10.046793775378683},null,null,null,{"$f":"IF(BG10<0,-BG10,\"\")","v":""}]
[null,null,null,null,{"$f":"IF(D10<0,D10,\"\")","v":-3.7234423207822727},null,null,null,{"$f":"IF(D10>0,D10,\"\")","v":""},null,null,null,null,null,{"$f":"IF(N12<0,N12,\"\")","v":-0.96667927032210765},null,null,null,{"$f":"IF(N12>0,N12,\"\")","v":""},null,null,null,null,null,{"$f":"IF(X12<0,X12,\"\")","v":""},null,null,null,{"$f":"IF(X12>0,X12,\"\")","v":4.6764205385191673},null,null,null,null,null,{"$f":"IF(AH12<0,AH12,\"\")","v":-0.83378803708468086},null,null,null,{"$f":"IF(AH12>0,AH12,\"\")","v":""},null,null,null,null,null,{"$f":"IF(AR12<0,AR12,\"\")","v":-5.399661011477451},null,null,null,{"$f":"IF(AR12>0,AR12,\"\")","v":""},null,null,null,null,null,{"$f":"IF(BB12<0,BB12,\"\")","v":""},null,null,null,{"$f":"IF(BB12>0,BB12,\"\")","v":10.046793775378683}]
[]
[]
[null,null,null,null,null,null,null,null,null,null,null,{"$f":"+M116","v":17.987920375178472},null,null,null,null,null,null,null,null,null,{"$f":"+W116","v":25.6879333478551},null,null,null,null,null,null,null,null,null,{"$f":"+AG116","v":7.2992051225005916},null,null,null,null,null,null,null,null,null,{"$f":"+AQ116","v":8.6389976048030537},null,null,null,null,null,null,null,null,null,{"$f":"+BA116","v":32.606216433475254}]
[]
[]
[]
[]
[]
[]
[]
[]
[null,null,null,{"$f":"IF(D10>0,-D10/2,\"\")","v":""},null,null,null,null,null,{"$f":"IF(D10<0,-D10/2,\"\")","v":1.8617211603911363},null,null,null,{"$f":"IF(N12>0,-N12/2,\"\")","v":""},null,null,null,null,null,{"$f":"IF(N12<0,-N12/2,\"\")","v":0.48333963516105383},null,null,null,{"$f":"IF(X12>0,-X12/2,\"\")","v":-2.3382102692595836},null,null,null,null,null,{"$f":"IF(X12<0,-X12/2,\"\")","v":""},null,null,null,{"$f":"IF(AH12>0,-AH12/2,\"\")","v":""},null,null,null,null,null,{"$f":"IF(AH12<0,-AH12/2,\"\")","v":0.41689401854234043},null,null,null,{"$f":"IF(AR12>0,-AR12/2,\"\")","v":""},null,null,null,null,null,{"$f":"IF(AR12<0,-AR12/2,\"\")","v":2.6998305057387255},null,null,null,{"$f":"IF(BB12>0,-BB12/2,\"\")","v":-5.0233968876893416},null,null,null,null,null,{"$f":"IF(BB12<0,-BB12/2,\"\")","v":""}]
[]
[]
[null,null,null,{"$f":"IF(I12<0,(I12+I12/2)/$BL$14,\"\")","v":-1.4697798634666868},null,null,null,null,null,{"$f":"IF(I12>0,(I12+I12/2)/$BL$14,\"\")","v":""},null,null,null,{"$f":"IF(S12<0,(S12+S12/2)/$BL$14,\"\")","v":-0.38158392249556877},null,null,null,null,null,{"$f":"IF(S12>0,(S12+S12/2)/$BL$14,\"\")","v":""},null,null,null,{"$f":"IF(AC12<0,(AC12+AC12/2)/$BL$14,\"\")","v":""},null,null,null,null,null,{"$f":"IF(AC12>0,(AC12+AC12/2)/$BL$14,\"\")","v":1.8459554757312504},null,null,null,{"$f":"IF(AM12<0,(AM12+AM12/2)/$BL$14,\"\")","v":-0.32912685674395298},null,null,null,null,null,{"$f":"IF(AM12>0,(AM12+AM12/2)/$BL$14,\"\")","v":""},null,null,null,{"$f":"IF(AW12<0,(AW12+AW12/2)/$BL$14,\"\")","v":-2.1314451361095199},null,null,null,null,null,{"$f":"IF(AW12>0,(AW12+AW12/2)/$BL$14,\"\")","v":""},null,null,null,{"$f":"IF(BG10<0,(BG10+BG10/2)/$BL$14,\"\")","v":""},null,null,null,null,null,{"$f":"IF(BG10>0,(BG10+BG10/2)/$BL$14,\"\")","v":3.9658396481757965}]
[]
[]
[null,null,null,null,null,null,null,null,null,"kesme kuvveti diyagramı (KN)"]
[]
[]
[]
[null,null,null,null,null,null,null,{"$f":"+M112","v":35.086238762544646},null,null,null,null,null,null,null,null,null,{"$f":"+W112","v":36.451569876496286},null,null,null,null,null,null,null,null,null,{"$f":"+AG112","v":27.152350592709915},null,null,null,null,null,null,null,null,null,{"$f":"+AQ112","v":21.179355523353145},null,null,null,null,null,null,null,null,null,{"$f":"+BA112","v":49.038707642097236},null,null,null,null,null,null,null,null,null,{"$f":"IF(BG21=0,\"\",BH19*BG36+BH17)","v":24}]
[]
[null,null,null,{"$f":"IF(D77<0,D77,\"\")","v":-1.4697798634666868},null,null,null,null,null,{"$f":"IF(J77>0,J77,\"\")","v":""},null,null,null,{"$f":"IF(N77<0,N77,\"\")","v":-0.38158392249556877},null,null,null,null,null,{"$f":"IF(T77>0,T77,\"\")","v":""},null,null,null,{"$f":"IF(X77<0,X77,\"\")","v":""},null,null,null,null,null,{"$f":"IF(AD77>0,AD77,\"\")","v":1.8459554757312504},null,null,null,{"$f":"IF(AH77<0,AH77,\"\")","v":-0.32912685674395298},null,null,null,null,null,{"$f":"IF(AN77>0,AN77,\"\")","v":""},null,null,null,{"$f":"IF(AR77<0,AR77,\"\")","v":-2.1314451361095199},null,null,null,null,null,{"$f":"IF(AX77>0,AX77,\"\")","v":""},null,null,null,{"$f":"IF(BB77<0,BB77,\"\")","v":""},null,null,null,null,null,{"$f":"IF(BH77>0,BH77,\"\")","v":3.9658396481757965}]
[null,null,null,{"$f":"IF(D99<0,D99,\"\")","v":-1.4697798634666868},null,null,null,null,null,{"$f":"IF(J99>0,J99,\"\")","v":""},null,null,null,{"$f":"IF(N99<0,N99,\"\")","v":-0.38158392249556877},null,null,null,null,null,{"$f":"IF(T99>0,T99,\"\")","v":""},null,null,null,{"$f":"IF(X99<0,X99,\"\")","v":""},null,null,null,null,null,{"$f":"IF(AD99>0,AD99,\"\")","v":1.8459554757312504},null,null,null,{"$f":"IF(AH99<0,AH99,\"\")","v":-0.32912685674395298},null,null,null,null,null,{"$f":"IF(AN99>0,AN99,\"\")","v":""},null,null,null,{"$f":"IF(AR99<0,AR99,\"\")","v":-2.1314451361095199},null,null,null,null,null,{"$f":"IF(AX99>0,AX99,\"\")","v":""},null,null,null,{"$f":"IF(BB99<0,BB99,\"\")","v":""},null,null,null,null,null,{"$f":"IF(BH99>0,BH99,\"\")","v":3.9658396481757965}]
[]
[null,null,null,null,null,null,null,null,null,null,null,null,null,null,null,{"$f":"-M113","v":-44.413761237455354},null,null,null,null,null,null,null,null,null,{"$f":"-W113","v":-35.548430123503714},null,null,null,null,null,null,null,null,null,{"$f":"-AG113","v":-19.847649407290085},null,null,null,null,null,null,null,null,null,{"$f":"-AQ113","v":-35.820644476646855},null,null,null,null,null,null,null,null,null,{"$f":"-BA113","v":-45.461292357902764}]
[null,null,null,null,null,{"$f":"IF(E21=0,\"\",-C19*D36-D17)","v":-24}]
[null,null,null,null,null,null,null,null,{"$f":"+M114","v":2.3390825841696432},null,"m",null,null,null,null,null,null,null,{"$f":"+W114","v":3.25},null,"m",null,null,null,null,null,null,null,{"$f":"+AG114","v":1.75},null,"m",null,null,null,null,null,null,null,{"$f":"+AQ114","v":2.1179355523353145},null,"m",null,null,null,null,null,null,null,{"$f":"+BA114","v":2.75},null,"m"]
[]
[]
[]
[]
[]
[]
[]
[null,null,null,{"$f":"IF(D10<0,(D10+D10/2)/$BL$25,\"\")","v":-1.4697798634666868},null,null,null,null,null,{"$f":"IF(D10>0,(D10+D10/2)/$BL$25,\"\")","v":""},null,null,null,{"$f":"IF(N12<0,(N12+N12/2)/$BL$25,\"\")","v":-0.38158392249556877},null,null,null,null,null,{"$f":"IF(N12>0,(N12+N12/2)/$BL$25,\"\")","v":""},null,null,null,{"$f":"IF(X12<0,(X12+X12/2)/$BL$25,\"\")","v":""},null,null,null,null,null,{"$f":"IF(X12>0,(X12+X12/2)/$BL$25,\"\")","v":1.8459554757312504},null,null,null,{"$f":"IF(AH12<0,(AH12+AH12/2)/$BL$25,\"\")","v":-0.32912685674395298},null,null,null,null,null,{"$f":"IF(AH12>0,(AH12+AH12/2)/$BL$25,\"\")","v":""},null,null,null,{"$f":"IF(AR12<0,(AR12+AR12/2)/$BL$25,\"\")","v":-2.1314451361095199},null,null,null,null,null,{"$f":"IF(AR12>0,(AR12+AR12/2)/$BL$25,\"\")","v":""},null,null,null,{"$f":"IF(BB12<0,(BB12+BB12/2)/$BL$25,\"\")","v":""},null,null,null,null,null,{"$f":"IF(BB12>0,(BB12+BB12/2)/$BL$25,\"\")","v":3.9658396481757965}]
[]
[null,"kiriş faydalı yükseklik \nd = h - d'     (m)",null,null,null,null,null,{"$f":"O46-N3","v":0.66999999999999993},null,null,null,null,null,null,null,null,null,{"$f":"Y46-N3","v":0.66999999999999993},null,null,null,null,null,null,null,null,null,{"$f":"AI46-N3","v":0.66999999999999993},null,null,null,null,null,null,null,null,null,{"$f":"AS46-N3","v":0.66999999999999993},null,null,null,null,null,null,null,null,null,{"$f":"BC46-N3","v":0.66999999999999993}]
[]
[]
[]
[null,null,null,{"$f":"IF(OR(C19=0,C19=\"\",D36=0,D36=\"\"),0,IF(OR(D17=0,D17=\"\",C34=0,C34=\"\"),1,2))","v":2},null,null,null,null,null,null,null,"sol moment     M1=",{"$f":"+I31","v":23.046884641564542},{"$f":"IF(M110=0,0,IF(M117=\"durum 1\",1,IF(M117=\"durum 2\",2,IF(M117=\"durum 3\",3))))","v":1},null,null,null,null,null,null,null,"sol moment     M1=",{"$f":"+S31","v":39.967168750757828},{"$f":"IF(W110=0,0,IF(W117=\"durum 1\",1,IF(W117=\"durum 2\",2,IF(W117=\"durum 3\",3))))","v":2},null,null,null,null,null,null,null,"sol moment     M1=",{"$f":"+AC31","v":24.904908414741758},{"$f":"IF(AG110=0,0,IF(AG117=\"durum 1\",1,IF(AG117=\"durum 2\",2,IF(AG117=\"durum 3\",3))))","v":2},null,null,null,null,null,null,null,"sol moment     M1=",{"$f":"+AM31","v":13.789257414426414},{"$f":"IF(AQ110=0,0,IF(AQ117=\"durum 1\",1,IF(AQ117=\"durum 2\",2,IF(AQ117=\"durum 3\",3))))","v":1},null,null,null,null,null,null,null,"sol moment     M1=",{"$f":"+AW31","v":45.53147958229215},{"$f":"IF(BA110=0,0,IF(BA117=\"durum 1\",1,IF(BA117=\"durum 2\",2,IF(BA117=\"durum 3\",3))))","v":2},null,null,null,null,null,null,{"$f":"IF(OR(BG36=0,BG36=\"\",BH19=0,BH19=\"\"),0,IF(OR(BH17=0,BH17=\"\",BI34=0,BI34=\"\"),1,2))","v":2}]
[null,null,null,null,null,null,null,null,null,null,null,"sağ moment     M2=",{"$f":"-O31","v":38.033810210113622},null,null,null,null,null,null,null,null,"sağ moment     M2=",{"$f":"-Y31","v":34.257749491780089},null,null,null,null,null,null,null,null,"sağ moment     M2=",{"$f":"-AI31","v":12.121681340257053},null,null,null,null,null,null,null,null,"sağ moment     M2=",{"$f":"-AS31","v":34.732157559337246},null,null,null,null,null,null,null,null,"sağ moment     M2=",{"$f":"-BC31","v":35.693587550757371}]
[null,null,null,null,null,null,null,null,null,null,null,"tekil yük        K=",{"$f":"+K17","v":12},null,null,null,null,null,null,null,null,"tekil yük        K=",{"$f":"+U17","v":12},null,null,null,null,null,null,null,null,"tekil yük        K=",{"$f":"+AE17","v":12},null,null,null,null,null,null,null,null,"tekil yük        K=",{"$f":"+AO17","v":12},null,null,null,null,null,null,null,null,"tekil yük        K=",{"$f":"+AY17","v":12}]
[null,null,null,null,null,null,null,null,null,null,null,"yayılı yük      Pd=",{"$f":"+L19","v":15},null,null,null,null,null,null,null,null,"yayılı yük      Pd=",{"$f":"+V19","v":10},null,null,null,null,null,null,null,null,"yayılı yük      Pd=",{"$f":"+AF19","v":10},null,null,null,null,null,null,null,null,"yayılı yük      Pd=",{"$f":"+AP19","v":10},null,null,null,null,null,null,null,null,"yayılı yük      Pd=",{"$f":"+AZ19","v":15}]
[null,null,null,null,null,null,null,null,null,null,null,"L=",{"$f":"+L36","v":4.5},null,null,null,null,null,null,null,null,"L=",{"$f":"+V36","v":6},null,null,null,null,null,null,null,null,"L=",{"$f":"+AF36","v":3.5},null,null,null,null,null,null,null,null,"L=",{"$f":"+AP36","v":4.5},null,null,null,null,null,null,null,null,"L=",{"$f":"+AZ36","v":5.5}]
[null,null,null,null,null,null,null,null,null,null,null,"(K=0 ise a=0 alınacak)     a=",{"$f":"IF(OR(K17=0,K17=\"\",I34=0,I34=\"\"),0,I34)","v":2.75},null,null,null,null,null,null,null,null,"(K=0 ise a=0 alınacak)     a=",{"$f":"IF(OR(U17=0,U17=\"\",S34=0,S34=\"\"),0,S34)","v":3.25},null,null,null,null,null,null,null,null,"(K=0 ise a=0 alınacak)     a=",{"$f":"IF(OR(AE17=0,AE17=\"\",AC34=0,AC34=\"\"),0,AC34)","v":1.75},null,null,null,null,null,null,null,null,"(K=0 ise a=0 alınacak)     a=",{"$f":"IF(OR(AO17=0,AO17=\"\",AM34=0,AM34=\"\"),0,AM34)","v":3.25},null,null,null,null,null,null,null,null,"(K=0 ise a=0 alınacak)     a=",{"$f":"IF(OR(AY17=0,AY17=\"\",AW34=0,AW34=\"\"),0,AW34)","v":2.75}]
[null,null,null,null,null,null,null,null,null,null,null,"b=",{"$f":"M109-M110","v":1.75},null,null,null,null,null,null,null,null,"b=",{"$f":"W109-W110","v":2.75},null,null,null,null,null,null,null,null,"b=",{"$f":"AG109-AG110","v":1.75},null,null,null,null,null,null,null,null,"b=",{"$f":"AQ109-AQ110","v":1.25},null,null,null,null,null,null,null,null,"b=",{"$f":"BA109-BA110","v":2.75}]
[null,null,null,null,null,null,null,null,null,null,null,"(sol eksen kesme kuvveti)  A=",{"$f":"IF(M107>0,M108*M109+M107-M113,M108*M109-M113)","v":35.086238762544646},null,null,null,null,null,null,null,null,"(sol eksen kesme kuvveti)  A=",{"$f":"IF(W107>0,W108*W109+W107-W113,W108*W109-W113)","v":36.451569876496286},null,null,null,null,null,null,null,null,"(sol eksen kesme kuvveti)  A=",{"$f":"IF(AG107>0,AG108*AG109+AG107-AG113,AG108*AG109-AG113)","v":27.152350592709915},null,null,null,null,null,null,null,null,"(sol eksen kesme kuvveti)  A=",{"$f":"IF(AQ107>0,AQ108*AQ109+AQ107-AQ113,AQ108*AQ109-AQ113)","v":21.179355523353145},null,null,null,null,null,null,null,null,"(sol eksen kesme kuvveti)  A=",{"$f":"IF(BA107>0,BA108*BA109+BA107-BA113,BA108*BA109-BA113)","v":49.038707642097236}]
[null,null,null,null,null,null,null,null,null,null,null,"(sağ eksen kesme kuvveti)  B=",{"$f":"IF(M107>0,(M108*M109^2*0.5+M107*M110+M106-M105)/M109,(0.5*M108*M109^2+M106-M105)/M109)","v":44.413761237455354},null,null,null,null,null,null,null,null,"(sağ eksen kesme kuvveti)  B=",{"$f":"IF(W107>0,(W108*W109^2*0.5+W107*W110+W106-W105)/W109,(0.5*W108*W109^2+W106-W105)/W109)","v":35.548430123503714},null,null,null,null,null,null,null,null,"(sağ eksen kesme kuvveti)  B=",{"$f":"IF(AG107>0,(AG108*AG109^2*0.5+AG107*AG110+AG106-AG105)/AG109,(0.5*AG108*AG109^2+AG106-AG105)/AG109)","v":19.847649407290085},null,null,null,null,null,null,null,null,"(sağ eksen kesme kuvveti)  B=",{"$f":"IF(AQ107>0,(AQ108*AQ109^2*0.5+AQ107*AQ110+AQ106-AQ105)/AQ109,(0.5*AQ108*AQ109^2+AQ106-AQ105)/AQ109)","v":35.820644476646855},null,null,null,null,null,null,null,null,"(sağ eksen kesme kuvveti)  B=",{"$f":"IF(BA107>0,(BA108*BA109^2*0.5+BA107*BA110+BA106-BA105)/BA109,(0.5*BA108*BA109^2+BA106-BA105)/BA109)","v":45.461292357902764}]
[null,null,null,null,null,null,null,null,null,null,null,"(max mom yeri A'dan mesafesi)  x=",{"$f":"IF(M108*M110>M112,(M112*M110)/(M110*M108),IF(AND(M108*M110<M112,M107>M112-M108*M110),M110,IF(AND(M108*M110<M112,M107<M112-M108*M110),((M109-M110)*(M112-M108*M110-M107)/(M112-M108*M110-M107+M113))+M110,\"HATALI\")))","v":2.3390825841696432},null,null,null,null,null,null,null,null,"(max mom yeri A'dan mesafesi)  x=",{"$f":"IF(W108*W110>W112,(W112*W110)/(W110*W108),IF(AND(W108*W110<W112,W107>W112-W108*W110),W110,IF(AND(W108*W110<W112,W107<W112-W108*W110),((W109-W110)*(W112-W108*W110-W107)/(W112-W108*W110-W107+W113))+W110,\"HATALI\")))","v":3.25},null,null,null,null,null,null,null,null,"(max mom yeri A'dan mesafesi)  x=",{"$f":"IF(AG108*AG110>AG112,(AG112*AG110)/(AG110*AG108),IF(AND(AG108*AG110<AG112,AG107>AG112-AG108*AG110),AG110,IF(AND(AG108*AG110<AG112,AG107<AG112-AG108*AG110),((AG109-AG110)*(AG112-AG108*AG110-AG107)/(AG112-AG108*AG110-AG107+AG113))+AG110,\"HATALI\")))","v":1.75},null,null,null,null,null,null,null,null,"(max mom yeri A'dan mesafesi)  x=",{"$f":"IF(AQ108*AQ110>AQ112,(AQ112*AQ110)/(AQ110*AQ108),IF(AND(AQ108*AQ110<AQ112,AQ107>AQ112-AQ108*AQ110),AQ110,IF(AND(AQ108*AQ110<AQ112,AQ107<AQ112-AQ108*AQ110),((AQ109-AQ110)*(AQ112-AQ108*AQ110-AQ107)/(AQ112-AQ108*AQ110-AQ107+AQ113))+AQ110,\"HATALI\")))","v":2.1179355523353145},null,null,null,null,null,null,null,null,"(max mom yeri A'dan mesafesi)  x=",{"$f":"IF(BA108*BA110>BA112,(BA112*BA110)/(BA110*BA108),IF(AND(BA108*BA110<BA112,BA107>BA112-BA108*BA110),BA110,IF(AND(BA108*BA110<BA112,BA107<BA112-BA108*BA110),((BA109-BA110)*(BA112-BA108*BA110-BA107)/(BA112-BA108*BA110-BA107+BA113))+BA110,\"HATALI\")))","v":2.75}]
[null,null,null,null,null,null,null,null,null,null,null,"açıklık momenti  Mmax=",{"$f":"IF(M108*M110>M112,(M112*M114/2)-M105,IF(AND(M108*M110<M112,M107>M112-M108*M110),(((M112+M112-M110*M108)/2)*M110)-M105,IF(AND(M108*M110<M112,M107<M112-M108*M110),(((M109-M110)*(M112-M108*M110-M107)/(M112-M108*M110-M107+M113))*(M112-M110*M108-M107)/2+(M112+M112-M110*M108)*M110/2)-M105,\"HATALI\")))","v":17.987920375178472},null,null,null,null,null,null,null,null,"açıklık momenti  Mmax=",{"$f":"IF(W108*W110>W112,(W112*W114/2)-W105,IF(AND(W108*W110<W112,W107>W112-W108*W110),(((W112+W112-W110*W108)/2)*W110)-W105,IF(AND(W108*W110<W112,W107<W112-W108*W110),(((W109-W110)*(W112-W108*W110-W107)/(W112-W108*W110-W107+W113))*(W112-W110*W108-W107)/2+(W112+W112-W110*W108)*W110/2)-W105,\"HATALI\")))","v":25.6879333478551},null,null,null,null,null,null,null,null,"açıklık momenti  Mmax=",{"$f":"IF(AG108*AG110>AG112,(AG112*AG114/2)-AG105,IF(AND(AG108*AG110<AG112,AG107>AG112-AG108*AG110),(((AG112+AG112-AG110*AG108)/2)*AG110)-AG105,IF(AND(AG108*AG110<AG112,AG107<AG112-AG108*AG110),(((AG109-AG110)*(AG112-AG108*AG110-AG107)/(AG112-AG108*AG110-AG107+AG113))*(AG112-AG110*AG108-AG107)/2+(AG112+AG112-AG110*AG108)*AG110/2)-AG105,\"HATALI\")))","v":7.2992051225005916},null,null,null,null,null,null,null,null,"açıklık momenti  Mmax=",{"$f":"IF(AQ108*AQ110>AQ112,(AQ112*AQ114/2)-AQ105,IF(AND(AQ108*AQ110<AQ112,AQ107>AQ112-AQ108*AQ110),(((AQ112+AQ112-AQ110*AQ108)/2)*AQ110)-AQ105,IF(AND(AQ108*AQ110<AQ112,AQ107<AQ112-AQ108*AQ110),(((AQ109-AQ110)*(AQ112-AQ108*AQ110-AQ107)/(AQ112-AQ108*AQ110-AQ107+AQ113))*(AQ112-AQ110*AQ108-AQ107)/2+(AQ112+AQ112-AQ110*AQ108)*AQ110/2)-AQ105,\"HATALI\")))","v":8.6389976048030537},null,null,null,null,null,null,null,null,"açıklık momenti  Mmax=",{"$f":"IF(BA108*BA110>BA112,(BA112*BA114/2)-BA105,IF(AND(BA108*BA110<BA112,BA107>BA112-BA108*BA110),(((BA112+BA112-BA110*BA108)/2)*BA110)-BA105,IF(AND(BA108*BA110<BA112,BA107<BA112-BA108*BA110),(((BA109-BA110)*(BA112-BA108*BA110-BA107)/(BA112-BA108*BA110-BA107+BA113))*(BA112-BA110*BA108-BA107)/2+(BA112+BA112-BA110*BA108)*BA110/2)-BA105,\"HATALI\")))","v":32.606216433475254}]
[null,null,null,null,null,null,null,null,null,null,null,"x'den bağımsız hesap        Mmax=",{"$f":"IF(M108*M110>M112,(M112*(IF(M108*M110>M112,(M112*M110)/(M110*M108),IF(AND(M108*M110<M112,M107>M112-M108*M110),M110,IF(AND(M108*M110<M112,M107<M112-M108*M110),((M109-M110)*(M112-M108*M110-M107)/(M112-M108*M110-M107+M113))+M110,\"HATALI\"))))/2)-M105,IF(AND(M108*M110<M112,M107>M112-M108*M110),(((M112+M112-M110*M108)/2)*M110)-M105,IF(AND(M108*M110<M112,M107<M112-M108*M110),(((M109-M110)*(M112-M108*M110-M107)/(M112-M108*M110-M107+M113))*(M112-M110*M108-M107)/2+(M112+M112-M110*M108)*M110/2)-M105,\"HATALI\")))","v":17.987920375178472},null,null,null,null,null,null,null,null,"x'den bağımsız hesap        Mmax=",{"$f":"IF(W108*W110>W112,(W112*(IF(W108*W110>W112,(W112*W110)/(W110*W108),IF(AND(W108*W110<W112,W107>W112-W108*W110),W110,IF(AND(W108*W110<W112,W107<W112-W108*W110),((W109-W110)*(W112-W108*W110-W107)/(W112-W108*W110-W107+W113))+W110,\"HATALI\"))))/2)-W105,IF(AND(W108*W110<W112,W107>W112-W108*W110),(((W112+W112-W110*W108)/2)*W110)-W105,IF(AND(W108*W110<W112,W107<W112-W108*W110),(((W109-W110)*(W112-W108*W110-W107)/(W112-W108*W110-W107+W113))*(W112-W110*W108-W107)/2+(W112+W112-W110*W108)*W110/2)-W105,\"HATALI\")))","v":25.6879333478551},null,null,null,null,null,null,null,null,"x'den bağımsız hesap        Mmax=",{"$f":"IF(AG108*AG110>AG112,(AG112*(IF(AG108*AG110>AG112,(AG112*AG110)/(AG110*AG108),IF(AND(AG108*AG110<AG112,AG107>AG112-AG108*AG110),AG110,IF(AND(AG108*AG110<AG112,AG107<AG112-AG108*AG110),((AG109-AG110)*(AG112-AG108*AG110-AG107)/(AG112-AG108*AG110-AG107+AG113))+AG110,\"HATALI\"))))/2)-AG105,IF(AND(AG108*AG110<AG112,AG107>AG112-AG108*AG110),(((AG112+AG112-AG110*AG108)/2)*AG110)-AG105,IF(AND(AG108*AG110<AG112,AG107<AG112-AG108*AG110),(((AG109-AG110)*(AG112-AG108*AG110-AG107)/(AG112-AG108*AG110-AG107+AG113))*(AG112-AG110*AG108-AG107)/2+(AG112+AG112-AG110*AG108)*AG110/2)-AG105,\"HATALI\")))","v":7.2992051225005916},null,null,null,null,null,null,null,null,"x'den bağımsız hesap        Mmax=",{"$f":"IF(AQ108*AQ110>AQ112,(AQ112*(IF(AQ108*AQ110>AQ112,(AQ112*AQ110)/(AQ110*AQ108),IF(AND(AQ108*AQ110<AQ112,AQ107>AQ112-AQ108*AQ110),AQ110,IF(AND(AQ108*AQ110<AQ112,AQ107<AQ112-AQ108*AQ110),((AQ109-AQ110)*(AQ112-AQ108*AQ110-AQ107)/(AQ112-AQ108*AQ110-AQ107+AQ113))+AQ110,\"HATALI\"))))/2)-AQ105,IF(AND(AQ108*AQ110<AQ112,AQ107>AQ112-AQ108*AQ110),(((AQ112+AQ112-AQ110*AQ108)/2)*AQ110)-AQ105,IF(AND(AQ108*AQ110<AQ112,AQ107<AQ112-AQ108*AQ110),(((AQ109-AQ110)*(AQ112-AQ108*AQ110-AQ107)/(AQ112-AQ108*AQ110-AQ107+AQ113))*(AQ112-AQ110*AQ108-AQ107)/2+(AQ112+AQ112-AQ110*AQ108)*AQ110/2)-AQ105,\"HATALI\")))","v":8.6389976048030537},null,null,null,null,null,null,null,null,"x'den bağımsız hesap        Mmax=",{"$f":"IF(BA108*BA110>BA112,(BA112*(IF(BA108*BA110>BA112,(BA112*BA110)/(BA110*BA108),IF(AND(BA108*BA110<BA112,BA107>BA112-BA108*BA110),BA110,IF(AND(BA108*BA110<BA112,BA107<BA112-BA108*BA110),((BA109-BA110)*(BA112-BA108*BA110-BA107)/(BA112-BA108*BA110-BA107+BA113))+BA110,\"HATALI\"))))/2)-BA105,IF(AND(BA108*BA110<BA112,BA107>BA112-BA108*BA110),(((BA112+BA112-BA110*BA108)/2)*BA110)-BA105,IF(AND(BA108*BA110<BA112,BA107<BA112-BA108*BA110),(((BA109-BA110)*(BA112-BA108*BA110-BA107)/(BA112-BA108*BA110-BA107+BA113))*(BA112-BA110*BA108-BA107)/2+(BA112+BA112-BA110*BA108)*BA110/2)-BA105,\"HATALI\")))","v":32.606216433475254}]
[null,null,null,null,null,null,null,null,null,null,null,"durum",{"$f":"IF(M108*M110>M112,\"durum 1\",IF(AND(M108*M110<M112,M107>M112-M108*M110),\"durum 2\",IF(AND(M108*M110<M112,M107<M112-M108*M110),\"durum 3\",\"HATALI\")))","v":"durum 1"},null,null,null,null,null,null,null,null,"durum",{"$f":"IF(W108*W110>W112,\"durum 1\",IF(AND(W108*W110<W112,W107>W112-W108*W110),\"durum 2\",IF(AND(W108*W110<W112,W107<W112-W108*W110),\"durum 3\",\"HATALI\")))","v":"durum 2"},null,null,null,null,null,null,null,null,"durum",{"$f":"IF(AG108*AG110>AG112,\"durum 1\",IF(AND(AG108*AG110<AG112,AG107>AG112-AG108*AG110),\"durum 2\",IF(AND(AG108*AG110<AG112,AG107<AG112-AG108*AG110),\"durum 3\",\"HATALI\")))","v":"durum 2"},null,null,null,null,null,null,null,null,"durum",{"$f":"IF(AQ108*AQ110>AQ112,\"durum 1\",IF(AND(AQ108*AQ110<AQ112,AQ107>AQ112-AQ108*AQ110),\"durum 2\",IF(AND(AQ108*AQ110<AQ112,AQ107<AQ112-AQ108*AQ110),\"durum 3\",\"HATALI\")))","v":"durum 1"},null,null,null,null,null,null,null,null,"durum",{"$f":"IF(BA108*BA110>BA112,\"durum 1\",IF(AND(BA108*BA110<BA112,BA107>BA112-BA108*BA110),\"durum 2\",IF(AND(BA108*BA110<BA112,BA107<BA112-BA108*BA110),\"durum 3\",\"HATALI\")))","v":"durum 2"}]
[null,null,null,null,null,null,null,null,null,null,null,"sol mesnet (kolon genişliği) s1=",{"$f":"+G38","v":0.5},null,null,null,null,null,null,null,null,"sol mesnet (kolon genişliği) s1=",{"$f":"+Q38","v":0.5},null,null,null,null,null,null,null,null,"sol mesnet (kolon genişliği) s1=",{"$f":"+AA38","v":0.5},null,null,null,null,null,null,null,null,"sol mesnet (kolon genişliği) s1=",{"$f":"+AK38","v":0.5},null,null,null,null,null,null,null,null,"sol mesnet (kolon genişliği) s1=",{"$f":"+AU38","v":0.5}]
[null,null,null,null,null,null,null,null,null,null,null,"sağ mesnet (kolon genişliği) s2=",{"$f":"+Q38","v":0.5},null,null,null,null,null,null,null,null,"sağ mesnet (kolon genişliği) s2=",{"$f":"+AA38","v":0.5},null,null,null,null,null,null,null,null,"sağ mesnet (kolon genişliği) s2=",{"$f":"+AK38","v":0.5},null,null,null,null,null,null,null,null,"sağ mesnet (kolon genişliği) s2=",{"$f":"+AU38","v":0.5},null,null,null,null,null,null,null,null,"sağ mesnet (kolon genişliği) s2=",{"$f":"+BE38","v":0.5}]
[null,null,null,null,null,null,null,null,null,null,null,"kiriş d yüksekliği=",{"$f":"+H101","v":0.66999999999999993},null,null,null,null,null,null,null,null,"kiriş d yüksekliği=",{"$f":"+R101","v":0.66999999999999993},null,null,null,null,null,null,null,null,"kiriş d yüksekliği=",{"$f":"+AB101","v":0.66999999999999993},null,null,null,null,null,null,null,null,"kiriş d yüksekliği=",{"$f":"+AL101","v":0.66999999999999993},null,null,null,null,null,null,null,null,"kiriş d yüksekliği=",{"$f":"+AV101","v":0.66999999999999993}]
[null,null,null,null,null,null,null,null,null,null,null,"kiriş h yüksekliği=",{"$f":"+O46","v":0.7},null,null,null,null,null,null,null,null,"kiriş h yüksekliği=",{"$f":"+Y46","v":0.7},null,null,null,null,null,null,null,null,"kiriş h yüksekliği=",{"$f":"+AI46","v":0.7},null,null,null,null,null,null,null,null,"kiriş h yüksekliği=",{"$f":"+AS46","v":0.7},null,null,null,null,null,null,null,null,"kiriş h yüksekliği=",{"$f":"+BC46","v":0.7}]
[null,null,null,null,null,null,null,null,null,null,null,"sol kolon yüzünden d mesafede kesme kuvveti",null,null,null,null,null,null,null,null,null,"sol kolon yüzünden d mesafede kesme kuvveti",null,null,null,null,null,null,null,null,null,"sol kolon yüzünden d mesafede kesme kuvveti",null,null,null,null,null,null,null,null,null,"sol kolon yüzünden d mesafede kesme kuvveti",null,null,null,null,null,null,null,null,null,"sol kolon yüzünden d mesafede kesme kuvveti"]
[null,null,null,null,null,null,null,null,null,null,null,"durum 1 için",{"$f":"IF(M114>(M120+M118/2),M112-M108*(M118/2+M120),IF(AND(M114<(M120+M118/2),(M120+M118/2)<M110),M108*(M120+M118/2)-M112,IF((M120+M118/2)=M110,M113-M108*M111,M108*M110-M112+M107+(M120+M118/2-M110)*M108)))","v":21.286238762544649},null,null,null,null,null,null,null,null,"durum 1 için",{"$f":"IF(W114>(W120+W118/2),W112-W108*(W118/2+W120),IF(AND(W114<(W120+W118/2),(W120+W118/2)<W110),W108*(W120+W118/2)-W112,IF((W120+W118/2)=W110,W113-W108*W111,W108*W110-W112+W107+(W120+W118/2-W110)*W108)))","v":27.251569876496287},null,null,null,null,null,null,null,null,"durum 1 için",{"$f":"IF(AG114>(AG120+AG118/2),AG112-AG108*(AG118/2+AG120),IF(AND(AG114<(AG120+AG118/2),(AG120+AG118/2)<AG110),AG108*(AG120+AG118/2)-AG112,IF((AG120+AG118/2)=AG110,AG113-AG108*AG111,AG108*AG110-AG112+AG107+(AG120+AG118/2-AG110)*AG108)))","v":17.952350592709916},null,null,null,null,null,null,null,null,"durum 1 için",{"$f":"IF(AQ114>(AQ120+AQ118/2),AQ112-AQ108*(AQ118/2+AQ120),IF(AND(AQ114<(AQ120+AQ118/2),(AQ120+AQ118/2)<AQ110),AQ108*(AQ120+AQ118/2)-AQ112,IF((AQ120+AQ118/2)=AQ110,AQ113-AQ108*AQ111,AQ108*AQ110-AQ112+AQ107+(AQ120+AQ118/2-AQ110)*AQ108)))","v":11.979355523353146},null,null,null,null,null,null,null,null,"durum 1 için",{"$f":"IF(BA114>(BA120+BA118/2),BA112-BA108*(BA118/2+BA120),IF(AND(BA114<(BA120+BA118/2),(BA120+BA118/2)<BA110),BA108*(BA120+BA118/2)-BA112,IF((BA120+BA118/2)=BA110,BA113-BA108*BA111,BA108*BA110-BA112+BA107+(BA120+BA118/2-BA110)*BA108)))","v":35.238707642097239}]
[null,null,null,null,null,null,null,null,null,null,null,"durum 2 için",{"$f":"IF(M120+M118/2<M110,M112-(M120+M118/2)*M108,IF((M118/2+M120)=M110,M112-M108*M110,IF(M120+M118/2>M110,M107-M112+M108*M110+(M120+M118/2-M110)*M108,0)))","v":21.286238762544649},null,null,null,null,null,null,null,null,"durum 2 için",{"$f":"IF(W120+W118/2<W110,W112-(W120+W118/2)*W108,IF((W118/2+W120)=W110,W112-W108*W110,IF(W120+W118/2>W110,W107-W112+W108*W110+(W120+W118/2-W110)*W108,0)))","v":27.251569876496287},null,null,null,null,null,null,null,null,"durum 2 için",{"$f":"IF(AG120+AG118/2<AG110,AG112-(AG120+AG118/2)*AG108,IF((AG118/2+AG120)=AG110,AG112-AG108*AG110,IF(AG120+AG118/2>AG110,AG107-AG112+AG108*AG110+(AG120+AG118/2-AG110)*AG108,0)))","v":17.952350592709916},null,null,null,null,null,null,null,null,"durum 2 için",{"$f":"IF(AQ120+AQ118/2<AQ110,AQ112-(AQ120+AQ118/2)*AQ108,IF((AQ118/2+AQ120)=AQ110,AQ112-AQ108*AQ110,IF(AQ120+AQ118/2>AQ110,AQ107-AQ112+AQ108*AQ110+(AQ120+AQ118/2-AQ110)*AQ108,0)))","v":11.979355523353146},null,null,null,null,null,null,null,null,"durum 2 için",{"$f":"IF(BA120+BA118/2<BA110,BA112-(BA120+BA118/2)*BA108,IF((BA118/2+BA120)=BA110,BA112-BA108*BA110,IF(BA120+BA118/2>BA110,BA107-BA112+BA108*BA110+(BA120+BA118/2-BA110)*BA108,0)))","v":35.238707642097239}]
[null,null,null,null,null,null,null,null,null,null,null,"durum 3 için",{"$f":"IF((M120+M118/2)<M110,M112-(M120+M118/2)*M108,IF(AND(M110<(M120+M118/2),(M120+M118/2)<M114),M112-M108*M110-M107-(M120+M118/2-M110)*M108,IF((M120+M118/2)>M114,(M120+M118/2-M114)*M108,IF((M120+M118/2)=M110,M112-M108*M110,0))))","v":21.286238762544649},null,null,null,null,null,null,null,null,"durum 3 için",{"$f":"IF((W120+W118/2)<W110,W112-(W120+W118/2)*W108,IF(AND(W110<(W120+W118/2),(W120+W118/2)<W114),W112-W108*W110-W107-(W120+W118/2-W110)*W108,IF((W120+W118/2)>W114,(W120+W118/2-W114)*W108,IF((W120+W118/2)=W110,W112-W108*W110,0))))","v":27.251569876496287},null,null,null,null,null,null,null,null,"durum 3 için",{"$f":"IF((AG120+AG118/2)<AG110,AG112-(AG120+AG118/2)*AG108,IF(AND(AG110<(AG120+AG118/2),(AG120+AG118/2)<AG114),AG112-AG108*AG110-AG107-(AG120+AG118/2-AG110)*AG108,IF((AG120+AG118/2)>AG114,(AG120+AG118/2-AG114)*AG108,IF((AG120+AG118/2)=AG110,AG112-AG108*AG110,0))))","v":17.952350592709916},null,null,null,null,null,null,null,null,"durum 3 için",{"$f":"IF((AQ120+AQ118/2)<AQ110,AQ112-(AQ120+AQ118/2)*AQ108,IF(AND(AQ110<(AQ120+AQ118/2),(AQ120+AQ118/2)<AQ114),AQ112-AQ108*AQ110-AQ107-(AQ120+AQ118/2-AQ110)*AQ108,IF((AQ120+AQ118/2)>AQ114,(AQ120+AQ118/2-AQ114)*AQ108,IF((AQ120+AQ118/2)=AQ110,AQ112-AQ108*AQ110,0))))","v":11.979355523353146},null,null,null,null,null,null,null,null,"durum 3 için",{"$f":"IF((BA120+BA118/2)<BA110,BA112-(BA120+BA118/2)*BA108,IF(AND(BA110<(BA120+BA118/2),(BA120+BA118/2)<BA114),BA112-BA108*BA110-BA107-(BA120+BA118/2-BA110)*BA108,IF((BA120+BA118/2)>BA114,(BA120+BA118/2-BA114)*BA108,IF((BA120+BA118/2)=BA110,BA112-BA108*BA110,0))))","v":35.238707642097239}]
[null,null,null,null,null,null,null,null,null,null,null,"sağ kolon yüzünden d mesafede kesme kuvveti",null,null,null,null,null,null,null,null,null,"sağ kolon yüzünden d mesafede kesme kuvveti",null,null,null,null,null,null,null,null,null,"sağ kolon yüzünden d mesafede kesme kuvveti",null,null,null,null,null,null,null,null,null,"sağ kolon yüzünden d mesafede kesme kuvveti",null,null,null,null,null,null,null,null,null,"sağ kolon yüzünden d mesafede kesme kuvveti"]
[null,null,null,null,null,null,null,null,null,null,null,"durum 1 için",{"$f":"IF((M120+M119/2)<M111,M113-(M120+M119/2)*M108,IF(AND((M120+M119/2)>M111,(M120+M119/2)<(M109-M114)),M113-M111*M108-M107-(M120+M119/2-M111)*M108,IF((M120+M119/2)=(M109-M110),M107+M108*M110-M112,((M120+M119/2)-(M109-M114))*M108)))","v":30.613761237455357},null,null,null,null,null,null,null,null,"durum 1 için",{"$f":"IF((W120+W119/2)<W111,W113-(W120+W119/2)*W108,IF(AND((W120+W119/2)>W111,(W120+W119/2)<(W109-W114)),W113-W111*W108-W107-(W120+W119/2-W111)*W108,IF((W120+W119/2)=(W109-W110),W107+W108*W110-W112,((W120+W119/2)-(W109-W114))*W108)))","v":26.348430123503714},null,null,null,null,null,null,null,null,"durum 1 için",{"$f":"IF((AG120+AG119/2)<AG111,AG113-(AG120+AG119/2)*AG108,IF(AND((AG120+AG119/2)>AG111,(AG120+AG119/2)<(AG109-AG114)),AG113-AG111*AG108-AG107-(AG120+AG119/2-AG111)*AG108,IF((AG120+AG119/2)=(AG109-AG110),AG107+AG108*AG110-AG112,((AG120+AG119/2)-(AG109-AG114))*AG108)))","v":10.647649407290086},null,null,null,null,null,null,null,null,"durum 1 için",{"$f":"IF((AQ120+AQ119/2)<AQ111,AQ113-(AQ120+AQ119/2)*AQ108,IF(AND((AQ120+AQ119/2)>AQ111,(AQ120+AQ119/2)<(AQ109-AQ114)),AQ113-AQ111*AQ108-AQ107-(AQ120+AQ119/2-AQ111)*AQ108,IF((AQ120+AQ119/2)=(AQ109-AQ110),AQ107+AQ108*AQ110-AQ112,((AQ120+AQ119/2)-(AQ109-AQ114))*AQ108)))","v":26.620644476646856},null,null,null,null,null,null,null,null,"durum 1 için",{"$f":"IF((BA120+BA119/2)<BA111,BA113-(BA120+BA119/2)*BA108,IF(AND((BA120+BA119/2)>BA111,(BA120+BA119/2)<(BA109-BA114)),BA113-BA111*BA108-BA107-(BA120+BA119/2-BA111)*BA108,IF((BA120+BA119/2)=(BA109-BA110),BA107+BA108*BA110-BA112,((BA120+BA119/2)-(BA109-BA114))*BA108)))","v":31.661292357902767}]
[null,null,null,null,null,null,null,null,null,null,null,"durum 2 için",{"$f":"IF((M120+M119/2)<M111,M113-(M120+M119/2)*M108,IF((M120+M119/2)=M111,M107-M112+M108*M110,IF((M120+M119/2)>M111,M112-(M109-(M120+M119/2))*M108,0)))","v":30.613761237455357},null,null,null,null,null,null,null,null,"durum 2 için",{"$f":"IF((W120+W119/2)<W111,W113-(W120+W119/2)*W108,IF((W120+W119/2)=W111,W107-W112+W108*W110,IF((W120+W119/2)>W111,W112-(W109-(W120+W119/2))*W108,0)))","v":26.348430123503714},null,null,null,null,null,null,null,null,"durum 2 için",{"$f":"IF((AG120+AG119/2)<AG111,AG113-(AG120+AG119/2)*AG108,IF((AG120+AG119/2)=AG111,AG107-AG112+AG108*AG110,IF((AG120+AG119/2)>AG111,AG112-(AG109-(AG120+AG119/2))*AG108,0)))","v":10.647649407290086},null,null,null,null,null,null,null,null,"durum 2 için",{"$f":"IF((AQ120+AQ119/2)<AQ111,AQ113-(AQ120+AQ119/2)*AQ108,IF((AQ120+AQ119/2)=AQ111,AQ107-AQ112+AQ108*AQ110,IF((AQ120+AQ119/2)>AQ111,AQ112-(AQ109-(AQ120+AQ119/2))*AQ108,0)))","v":26.620644476646856},null,null,null,null,null,null,null,null,"durum 2 için",{"$f":"IF((BA120+BA119/2)<BA111,BA113-(BA120+BA119/2)*BA108,IF((BA120+BA119/2)=BA111,BA107-BA112+BA108*BA110,IF((BA120+BA119/2)>BA111,BA112-(BA109-(BA120+BA119/2))*BA108,0)))","v":31.661292357902767}]
[null,null,null,null,null,null,null,null,null,null,null,"durum 3 için",{"$f":"IF((M109-M114)>(M120+M119/2),M113-(M120+M119/2)*M108,IF(AND((M120+M119/2)>(M109-M114),(M109-M110)>(M120+M119/2)),((M120+M119/2)-(M109-M114))*M108,IF(M120+M119/2>(M109-M110),M112-(M109-(M120+M119/2))*M108,IF((M120+M119/2)=(M109-M110),M112-M108*M110-M107,0))))","v":30.613761237455357},null,null,null,null,null,null,null,null,"durum 3 için",{"$f":"IF((W109-W114)>(W120+W119/2),W113-(W120+W119/2)*W108,IF(AND((W120+W119/2)>(W109-W114),(W109-W110)>(W120+W119/2)),((W120+W119/2)-(W109-W114))*W108,IF(W120+W119/2>(W109-W110),W112-(W109-(W120+W119/2))*W108,IF((W120+W119/2)=(W109-W110),W112-W108*W110-W107,0))))","v":26.348430123503714},null,null,null,null,null,null,null,null,"durum 3 için",{"$f":"IF((AG109-AG114)>(AG120+AG119/2),AG113-(AG120+AG119/2)*AG108,IF(AND((AG120+AG119/2)>(AG109-AG114),(AG109-AG110)>(AG120+AG119/2)),((AG120+AG119/2)-(AG109-AG114))*AG108,IF(AG120+AG119/2>(AG109-AG110),AG112-(AG109-(AG120+AG119/2))*AG108,IF((AG120+AG119/2)=(AG109-AG110),AG112-AG108*AG110-AG107,0))))","v":10.647649407290086},null,null,null,null,null,null,null,null,"durum 3 için",{"$f":"IF((AQ109-AQ114)>(AQ120+AQ119/2),AQ113-(AQ120+AQ119/2)*AQ108,IF(AND((AQ120+AQ119/2)>(AQ109-AQ114),(AQ109-AQ110)>(AQ120+AQ119/2)),((AQ120+AQ119/2)-(AQ109-AQ114))*AQ108,IF(AQ120+AQ119/2>(AQ109-AQ110),AQ112-(AQ109-(AQ120+AQ119/2))*AQ108,IF((AQ120+AQ119/2)=(AQ109-AQ110),AQ112-AQ108*AQ110-AQ107,0))))","v":26.620644476646856},null,null,null,null,null,null,null,null,"durum 3 için",{"$f":"IF((BA109-BA114)>(BA120+BA119/2),BA113-(BA120+BA119/2)*BA108,IF(AND((BA120+BA119/2)>(BA109-BA114),(BA109-BA110)>(BA120+BA119/2)),((BA120+BA119/2)-(BA109-BA114))*BA108,IF(BA120+BA119/2>(BA109-BA110),BA112-(BA109-(BA120+BA119/2))*BA108,IF((BA120+BA119/2)=(BA109-BA110),BA112-BA108*BA110-BA107,0))))","v":31.661292357902767}]
[null,null,null,null,null,null,null,null,null,null,null,"sol kolon yüzünden 2h mesafede kesme kuvveti",null,null,null,null,null,null,null,null,null,"sol kolon yüzünden 2h mesafede kesme kuvveti",null,null,null,null,null,null,null,null,null,"sol kolon yüzünden 2h mesafede kesme kuvveti",null,null,null,null,null,null,null,null,null,"sol kolon yüzünden 2h mesafede kesme kuvveti",null,null,null,null,null,null,null,null,null,"sol kolon yüzünden 2h mesafede kesme kuvveti"]
[null,null,null,null,null,null,null,null,null,null,null,"durum 1 için",{"$f":"IF(M114>(M121*2+M118/2),M112-M108*(M118/2+M121*2),IF(AND(M114<(M121*2+M118/2),(M121*2+M118/2)<M110),M108*(M121*2+M118/2)-M112,IF((M121*2+M118/2)=M110,M113-M108*M111,M108*M110-M112+M107+(M121*2+M118/2-M110)*M108)))","v":10.336238762544646},null,null,null,null,null,null,null,null,"durum 1 için",{"$f":"IF(W114>(W121*2+W118/2),W112-W108*(W118/2+W121*2),IF(AND(W114<(W121*2+W118/2),(W121*2+W118/2)<W110),W108*(W121*2+W118/2)-W112,IF((W121*2+W118/2)=W110,W113-W108*W111,W108*W110-W112+W107+(W121*2+W118/2-W110)*W108)))","v":19.951569876496286},null,null,null,null,null,null,null,null,"durum 1 için",{"$f":"IF(AG114>(AG121*2+AG118/2),AG112-AG108*(AG118/2+AG121*2),IF(AND(AG114<(AG121*2+AG118/2),(AG121*2+AG118/2)<AG110),AG108*(AG121*2+AG118/2)-AG112,IF((AG121*2+AG118/2)=AG110,AG113-AG108*AG111,AG108*AG110-AG112+AG107+(AG121*2+AG118/2-AG110)*AG108)))","v":10.652350592709915},null,null,null,null,null,null,null,null,"durum 1 için",{"$f":"IF(AQ114>(AQ121*2+AQ118/2),AQ112-AQ108*(AQ118/2+AQ121*2),IF(AND(AQ114<(AQ121*2+AQ118/2),(AQ121*2+AQ118/2)<AQ110),AQ108*(AQ121*2+AQ118/2)-AQ112,IF((AQ121*2+AQ118/2)=AQ110,AQ113-AQ108*AQ111,AQ108*AQ110-AQ112+AQ107+(AQ121*2+AQ118/2-AQ110)*AQ108)))","v":4.679355523353145},null,null,null,null,null,null,null,null,"durum 1 için",{"$f":"IF(BA114>(BA121*2+BA118/2),BA112-BA108*(BA118/2+BA121*2),IF(AND(BA114<(BA121*2+BA118/2),(BA121*2+BA118/2)<BA110),BA108*(BA121*2+BA118/2)-BA112,IF((BA121*2+BA118/2)=BA110,BA113-BA108*BA111,BA108*BA110-BA112+BA107+(BA121*2+BA118/2-BA110)*BA108)))","v":24.288707642097236}]
[null,null,null,null,null,null,null,null,null,null,null,"durum 2 için",{"$f":"IF(M121*2+M118/2<M110,M112-(M121*2+M118/2)*M108,IF((M118/2+M121*2)=M110,M112-M108*M110,IF(M121*2+M118/2>M110,M107-M112+M108*M110+(M121*2+M118/2-M110)*M108,0)))","v":10.336238762544646},null,null,null,null,null,null,null,null,"durum 2 için",{"$f":"IF(W121*2+W118/2<W110,W112-(W121*2+W118/2)*W108,IF((W118/2+W121*2)=W110,W112-W108*W110,IF(W121*2+W118/2>W110,W107-W112+W108*W110+(W121*2+W118/2-W110)*W108,0)))","v":19.951569876496286},null,null,null,null,null,null,null,null,"durum 2 için",{"$f":"IF(AG121*2+AG118/2<AG110,AG112-(AG121*2+AG118/2)*AG108,IF((AG118/2+AG121*2)=AG110,AG112-AG108*AG110,IF(AG121*2+AG118/2>AG110,AG107-AG112+AG108*AG110+(AG121*2+AG118/2-AG110)*AG108,0)))","v":10.652350592709915},null,null,null,null,null,null,null,null,"durum 2 için",{"$f":"IF(AQ121*2+AQ118/2<AQ110,AQ112-(AQ121*2+AQ118/2)*AQ108,IF((AQ118/2+AQ121*2)=AQ110,AQ112-AQ108*AQ110,IF(AQ121*2+AQ118/2>AQ110,AQ107-AQ112+AQ108*AQ110+(AQ121*2+AQ118/2-AQ110)*AQ108,0)))","v":4.679355523353145},null,null,null,null,null,null,null,null,"durum 2 için",{"$f":"IF(BA121*2+BA118/2<BA110,BA112-(BA121*2+BA118/2)*BA108,IF((BA118/2+BA121*2)=BA110,BA112-BA108*BA110,IF(BA121*2+BA118/2>BA110,BA107-BA112+BA108*BA110+(BA121*2+BA118/2-BA110)*BA108,0)))","v":24.288707642097236}]
[null,null,null,null,null,null,null,null,null,null,null,"durum 3 için",{"$f":"IF((M121*2+M118/2)<M110,M112-(M121*2+M118/2)*M108,IF(AND(M110<(M121*2+M118/2),(M121*2+M118/2)<M114),M112-M108*M110-M107-(M121*2+M118/2-M110)*M108,IF((M121*2+M118/2)>M114,(M121*2+M118/2-M114)*M108,IF((M121*2+M118/2)=M110,M112-M108*M110,0))))","v":10.336238762544646},null,null,null,null,null,null,null,null,"durum 3 için",{"$f":"IF((W121*2+W118/2)<W110,W112-(W121*2+W118/2)*W108,IF(AND(W110<(W121*2+W118/2),(W121*2+W118/2)<W114),W112-W108*W110-W107-(W121*2+W118/2-W110)*W108,IF((W121*2+W118/2)>W114,(W121*2+W118/2-W114)*W108,IF((W121*2+W118/2)=W110,W112-W108*W110,0))))","v":19.951569876496286},null,null,null,null,null,null,null,null,"durum 3 için",{"$f":"IF((AG121*2+AG118/2)<AG110,AG112-(AG121*2+AG118/2)*AG108,IF(AND(AG110<(AG121*2+AG118/2),(AG121*2+AG118/2)<AG114),AG112-AG108*AG110-AG107-(AG121*2+AG118/2-AG110)*AG108,IF((AG121*2+AG118/2)>AG114,(AG121*2+AG118/2-AG114)*AG108,IF((AG121*2+AG118/2)=AG110,AG112-AG108*AG110,0))))","v":10.652350592709915},null,null,null,null,null,null,null,null,"durum 3 için",{"$f":"IF((AQ121*2+AQ118/2)<AQ110,AQ112-(AQ121*2+AQ118/2)*AQ108,IF(AND(AQ110<(AQ121*2+AQ118/2),(AQ121*2+AQ118/2)<AQ114),AQ112-AQ108*AQ110-AQ107-(AQ121*2+AQ118/2-AQ110)*AQ108,IF((AQ121*2+AQ118/2)>AQ114,(AQ121*2+AQ118/2-AQ114)*AQ108,IF((AQ121*2+AQ118/2)=AQ110,AQ112-AQ108*AQ110,0))))","v":4.679355523353145},null,null,null,null,null,null,null,null,"durum 3 için",{"$f":"IF((BA121*2+BA118/2)<BA110,BA112-(BA121*2+BA118/2)*BA108,IF(AND(BA110<(BA121*2+BA118/2),(BA121*2+BA118/2)<BA114),BA112-BA108*BA110-BA107-(BA121*2+BA118/2-BA110)*BA108,IF((BA121*2+BA118/2)>BA114,(BA121*2+BA118/2-BA114)*BA108,IF((BA121*2+BA118/2)=BA110,BA112-BA108*BA110,0))))","v":24.288707642097236}]
[null,null,null,null,null,null,null,null,null,null,null,"sağ kolon yüzünden 2h mesafede kesme kuvveti",null,null,null,null,null,null,null,null,null,"sağ kolon yüzünden 2h mesafede kesme kuvveti",null,null,null,null,null,null,null,null,null,"sağ kolon yüzünden 2h mesafede kesme kuvveti",null,null,null,null,null,null,null,null,null,"sağ kolon yüzünden 2h mesafede kesme kuvveti",null,null,null,null,null,null,null,null,null,"sağ kolon yüzünden 2h mesafede kesme kuvveti"]
[null,null,null,null,null,null,null,null,null,null,null,"durum 1 için",{"$f":"IF((M121*2+M119/2)<M111,M113-(M121*2+M119/2)*M108,IF(AND((M121*2+M119/2)>M111,(M121*2+M119/2)<(M109-M114)),M113-M111*M108-M107-(M121*2+M119/2-M111)*M108,IF((M121*2+M119/2)=(M109-M110),M107+M108*M110-M112,((M121*2+M119/2)-(M109-M114))*M108)))","v":19.663761237455354},null,null,null,null,null,null,null,null,"durum 1 için",{"$f":"IF((W121*2+W119/2)<W111,W113-(W121*2+W119/2)*W108,IF(AND((W121*2+W119/2)>W111,(W121*2+W119/2)<(W109-W114)),W113-W111*W108-W107-(W121*2+W119/2-W111)*W108,IF((W121*2+W119/2)=(W109-W110),W107+W108*W110-W112,((W121*2+W119/2)-(W109-W114))*W108)))","v":19.048430123503714},null,null,null,null,null,null,null,null,"durum 1 için",{"$f":"IF((AG121*2+AG119/2)<AG111,AG113-(AG121*2+AG119/2)*AG108,IF(AND((AG121*2+AG119/2)>AG111,(AG121*2+AG119/2)<(AG109-AG114)),AG113-AG111*AG108-AG107-(AG121*2+AG119/2-AG111)*AG108,IF((AG121*2+AG119/2)=(AG109-AG110),AG107+AG108*AG110-AG112,((AG121*2+AG119/2)-(AG109-AG114))*AG108)))","v":3.3476494072900849},null,null,null,null,null,null,null,null,"durum 1 için",{"$f":"IF((AQ121*2+AQ119/2)<AQ111,AQ113-(AQ121*2+AQ119/2)*AQ108,IF(AND((AQ121*2+AQ119/2)>AQ111,(AQ121*2+AQ119/2)<(AQ109-AQ114)),AQ113-AQ111*AQ108-AQ107-(AQ121*2+AQ119/2-AQ111)*AQ108,IF((AQ121*2+AQ119/2)=(AQ109-AQ110),AQ107+AQ108*AQ110-AQ112,((AQ121*2+AQ119/2)-(AQ109-AQ114))*AQ108)))","v":7.3206444766468559},null,null,null,null,null,null,null,null,"durum 1 için",{"$f":"IF((BA121*2+BA119/2)<BA111,BA113-(BA121*2+BA119/2)*BA108,IF(AND((BA121*2+BA119/2)>BA111,(BA121*2+BA119/2)<(BA109-BA114)),BA113-BA111*BA108-BA107-(BA121*2+BA119/2-BA111)*BA108,IF((BA121*2+BA119/2)=(BA109-BA110),BA107+BA108*BA110-BA112,((BA121*2+BA119/2)-(BA109-BA114))*BA108)))","v":20.711292357902764}]
[null,null,null,null,null,null,null,null,null,null,null,"durum 2 için",{"$f":"IF((M121*2+M119/2)<M111,M113-(M121*2+M119/2)*M108,IF((M121*2+M119/2)=M111,M107-M112+M108*M110,IF((M121*2+M119/2)>M111,M112-(M109-(M121*2+M119/2))*M108,0)))","v":19.663761237455354},null,null,null,null,null,null,null,null,"durum 2 için",{"$f":"IF((W121*2+W119/2)<W111,W113-(W121*2+W119/2)*W108,IF((W121*2+W119/2)=W111,W107-W112+W108*W110,IF((W121*2+W119/2)>W111,W112-(W109-(W121*2+W119/2))*W108,0)))","v":19.048430123503714},null,null,null,null,null,null,null,null,"durum 2 için",{"$f":"IF((AG121*2+AG119/2)<AG111,AG113-(AG121*2+AG119/2)*AG108,IF((AG121*2+AG119/2)=AG111,AG107-AG112+AG108*AG110,IF((AG121*2+AG119/2)>AG111,AG112-(AG109-(AG121*2+AG119/2))*AG108,0)))","v":3.3476494072900849},null,null,null,null,null,null,null,null,"durum 2 için",{"$f":"IF((AQ121*2+AQ119/2)<AQ111,AQ113-(AQ121*2+AQ119/2)*AQ108,IF((AQ121*2+AQ119/2)=AQ111,AQ107-AQ112+AQ108*AQ110,IF((AQ121*2+AQ119/2)>AQ111,AQ112-(AQ109-(AQ121*2+AQ119/2))*AQ108,0)))","v":-7.320644476646855},null,null,null,null,null,null,null,null,"durum 2 için",{"$f":"IF((BA121*2+BA119/2)<BA111,BA113-(BA121*2+BA119/2)*BA108,IF((BA121*2+BA119/2)=BA111,BA107-BA112+BA108*BA110,IF((BA121*2+BA119/2)>BA111,BA112-(BA109-(BA121*2+BA119/2))*BA108,0)))","v":20.711292357902764}]
[null,null,null,null,null,null,null,null,null,null,null,"durum 3 için",{"$f":"IF((M109-M114)>(M121*2+M119/2),M113-(M121*2+M119/2)*M108,IF(AND((M121*2+M119/2)>(M109-M114),(M109-M110)>(M121*2+M119/2)),((M121*2+M119/2)-(M109-M114))*M108,IF(M121*2+M119/2>(M109-M110),M112-(M109-(M121*2+M119/2))*M108,IF((M121*2+M119/2)=(M109-M110),M112-M108*M110,0))))","v":19.663761237455354},null,null,null,null,null,null,null,null,"durum 3 için",{"$f":"IF((W109-W114)>(W121*2+W119/2),W113-(W121*2+W119/2)*W108,IF(AND((W121*2+W119/2)>(W109-W114),(W109-W110)>(W121*2+W119/2)),((W121*2+W119/2)-(W109-W114))*W108,IF(W121*2+W119/2>(W109-W110),W112-(W109-(W121*2+W119/2))*W108,IF((W121*2+W119/2)=(W109-W110),W112-W108*W110,0))))","v":19.048430123503714},null,null,null,null,null,null,null,null,"durum 3 için",{"$f":"IF((AG109-AG114)>(AG121*2+AG119/2),AG113-(AG121*2+AG119/2)*AG108,IF(AND((AG121*2+AG119/2)>(AG109-AG114),(AG109-AG110)>(AG121*2+AG119/2)),((AG121*2+AG119/2)-(AG109-AG114))*AG108,IF(AG121*2+AG119/2>(AG109-AG110),AG112-(AG109-(AG121*2+AG119/2))*AG108,IF((AG121*2+AG119/2)=(AG109-AG110),AG112-AG108*AG110,0))))","v":3.3476494072900849},null,null,null,null,null,null,null,null,"durum 3 için",{"$f":"IF((AQ109-AQ114)>(AQ121*2+AQ119/2),AQ113-(AQ121*2+AQ119/2)*AQ108,IF(AND((AQ121*2+AQ119/2)>(AQ109-AQ114),(AQ109-AQ110)>(AQ121*2+AQ119/2)),((AQ121*2+AQ119/2)-(AQ109-AQ114))*AQ108,IF(AQ121*2+AQ119/2>(AQ109-AQ110),AQ112-(AQ109-(AQ121*2+AQ119/2))*AQ108,IF((AQ121*2+AQ119/2)=(AQ109-AQ110),AQ112-AQ108*AQ110,0))))","v":19.320644476646855},null,null,null,null,null,null,null,null,"durum 3 için",{"$f":"IF((BA109-BA114)>(BA121*2+BA119/2),BA113-(BA121*2+BA119/2)*BA108,IF(AND((BA121*2+BA119/2)>(BA109-BA114),(BA109-BA110)>(BA121*2+BA119/2)),((BA121*2+BA119/2)-(BA109-BA114))*BA108,IF(BA121*2+BA119/2>(BA109-BA110),BA112-(BA109-(BA121*2+BA119/2))*BA108,IF((BA121*2+BA119/2)=(BA109-BA110),BA112-BA108*BA110,0))))","v":20.711292357902764}]
[null,null,null,null,null,null,null,null,null,null,null,"sol kolon yüzünden d mesafede kesme kuvveti=",{"$f":"IF(M117=\"durum 1\",M123,IF(M117=\"durum 2\",M124,IF(M117=\"durum 3\",M125,\"hatalı\")))","v":21.286238762544649},null,null,null,null,null,null,null,null,"sol kolon yüzünden d mesafede kesme kuvveti=",{"$f":"IF(W117=\"durum 1\",W123,IF(W117=\"durum 2\",W124,IF(W117=\"durum 3\",W125,\"hatalı\")))","v":27.251569876496287},null,null,null,null,null,null,null,null,"sol kolon yüzünden d mesafede kesme kuvveti=",{"$f":"IF(AG117=\"durum 1\",AG123,IF(AG117=\"durum 2\",AG124,IF(AG117=\"durum 3\",AG125,\"hatalı\")))","v":17.952350592709916},null,null,null,null,null,null,null,null,"sol kolon yüzünden d mesafede kesme kuvveti=",{"$f":"IF(AQ117=\"durum 1\",AQ123,IF(AQ117=\"durum 2\",AQ124,IF(AQ117=\"durum 3\",AQ125,\"hatalı\")))","v":11.979355523353146},null,null,null,null,null,null,null,null,"sol kolon yüzünden d mesafede kesme kuvveti=",{"$f":"IF(BA117=\"durum 1\",BA123,IF(BA117=\"durum 2\",BA124,IF(BA117=\"durum 3\",BA125,\"hatalı\")))","v":35.238707642097239}]
[null,null,null,null,null,null,null,null,null,null,null,"sağ kolon yüzünden d mesafede kesme kuvveti=",{"$f":"IF(M117=\"durum 1\",M127,IF(M117=\"durum 2\",M128,IF(M117=\"durum 3\",M129,\"hatalı\")))","v":30.613761237455357},null,null,null,null,null,null,null,null,"sağ kolon yüzünden d mesafede kesme kuvveti=",{"$f":"IF(W117=\"durum 1\",W127,IF(W117=\"durum 2\",W128,IF(W117=\"durum 3\",W129,\"hatalı\")))","v":26.348430123503714},null,null,null,null,null,null,null,null,"sağ kolon yüzünden d mesafede kesme kuvveti=",{"$f":"IF(AG117=\"durum 1\",AG127,IF(AG117=\"durum 2\",AG128,IF(AG117=\"durum 3\",AG129,\"hatalı\")))","v":10.647649407290086},null,null,null,null,null,null,null,null,"sağ kolon yüzünden d mesafede kesme kuvveti=",{"$f":"IF(AQ117=\"durum 1\",AQ127,IF(AQ117=\"durum 2\",AQ128,IF(AQ117=\"durum 3\",AQ129,\"hatalı\")))","v":26.620644476646856},null,null,null,null,null,null,null,null,"sağ kolon yüzünden d mesafede kesme kuvveti=",{"$f":"IF(BA117=\"durum 1\",BA127,IF(BA117=\"durum 2\",BA128,IF(BA117=\"durum 3\",BA129,\"hatalı\")))","v":31.661292357902767}]
[null,null,null,null,null,null,null,null,null,null,null,"sol kolon yüzünden 2h mesafede kesme kuvveti=",{"$f":"IF(M117=\"durum 1\",M131,IF(M117=\"durum 2\",M132,IF(M117=\"durum 3\",M133,\"hatalı\")))","v":10.336238762544646},null,null,null,null,null,null,null,null,"sol kolon yüzünden 2h mesafede kesme kuvveti=",{"$f":"IF(W117=\"durum 1\",W131,IF(W117=\"durum 2\",W132,IF(W117=\"durum 3\",W133,\"hatalı\")))","v":19.951569876496286},null,null,null,null,null,null,null,null,"sol kolon yüzünden 2h mesafede kesme kuvveti=",{"$f":"IF(AG117=\"durum 1\",AG131,IF(AG117=\"durum 2\",AG132,IF(AG117=\"durum 3\",AG133,\"hatalı\")))","v":10.652350592709915},null,null,null,null,null,null,null,null,"sol kolon yüzünden 2h mesafede kesme kuvveti=",{"$f":"IF(AQ117=\"durum 1\",AQ131,IF(AQ117=\"durum 2\",AQ132,IF(AQ117=\"durum 3\",AQ133,\"hatalı\")))","v":4.679355523353145},null,null,null,null,null,null,null,null,"sol kolon yüzünden 2h mesafede kesme kuvveti=",{"$f":"IF(BA117=\"durum 1\",BA131,IF(BA117=\"durum 2\",BA132,IF(BA117=\"durum 3\",BA133,\"hatalı\")))","v":24.288707642097236}]
[null,null,null,null,null,null,null,null,null,null,null,"sağ kolon yüzünden 2h mesafede kesme kuvveti=",{"$f":"IF(M117=\"durum 1\",M135,IF(M117=\"durum 2\",M136,IF(M117=\"durum 3\",M137,\"hatalı\")))","v":19.663761237455354},null,null,null,null,null,null,null,null,"sağ kolon yüzünden 2h mesafede kesme kuvveti=",{"$f":"IF(W117=\"durum 1\",W135,IF(W117=\"durum 2\",W136,IF(W117=\"durum 3\",W137,\"hatalı\")))","v":19.048430123503714},null,null,null,null,null,null,null,null,"sağ kolon yüzünden 2h mesafede kesme kuvveti=",{"$f":"IF(AG117=\"durum 1\",AG135,IF(AG117=\"durum 2\",AG136,IF(AG117=\"durum 3\",AG137,\"hatalı\")))","v":3.3476494072900849},null,null,null,null,null,null,null,null,"sağ kolon yüzünden 2h mesafede kesme kuvveti=",{"$f":"IF(AQ117=\"durum 1\",AQ135,IF(AQ117=\"durum 2\",AQ136,IF(AQ117=\"durum 3\",AQ137,\"hatalı\")))","v":7.3206444766468559},null,null,null,null,null,null,null,null,"sağ kolon yüzünden 2h mesafede kesme kuvveti=",{"$f":"IF(BA117=\"durum 1\",BA135,IF(BA117=\"durum 2\",BA136,IF(BA117=\"durum 3\",BA137,\"hatalı\")))","v":20.711292357902764}]
[null,"kiriş kolon yüzünden d mesafede kesme kuvveti (KN)",null,null,null,null,null,{"$f":"+M138","v":21.286238762544649},null,null,null,null,null,null,{"$f":"+M139","v":30.613761237455357},null,null,{"$f":"+W138","v":27.251569876496287},null,null,null,null,null,null,{"$f":"+W139","v":26.348430123503714},null,null,{"$f":"+AG138","v":17.952350592709916},null,null,null,null,null,null,{"$f":"+AG139","v":10.647649407290086},null,null,{"$f":"+AQ138","v":11.979355523353146},null,null,null,null,null,null,{"$f":"+AQ139","v":26.620644476646856},null,null,{"$f":"+BA138","v":35.238707642097239},null,null,null,null,null,null,{"$f":"+BA139","v":31.661292357902767}]
[]
[]
[]
[]
[null,"kiriş kolon yüzünden 2*h mesafede kesme kuvveti (KN)",null,null,null,null,null,{"$f":"+M140","v":10.336238762544646},null,null,null,null,null,null,{"$f":"+M141","v":19.663761237455354},null,null,{"$f":"+W140","v":19.951569876496286},null,null,null,null,null,null,{"$f":"+W141","v":19.048430123503714},null,null,{"$f":"+AG140","v":10.652350592709915},null,null,null,null,null,null,{"$f":"+AG141","v":3.3476494072900849},null,null,{"$f":"+AQ140","v":4.679355523353145},null,null,null,null,null,null,{"$f":"+AQ141","v":7.3206444766468559},null,null,{"$f":"+BA140","v":24.288707642097236},null,null,null,null,null,null,{"$f":"+BA141","v":20.711292357902764}]
[]
[]
[]
[]
[null,"kiriş kolon yüzü kesme kuvveti (KN)",null,null,null,null,null,{"$f":"+M112-L19*G38/2","v":31.336238762544646},null,null,null,null,null,null,{"$f":"+M113-Q38/2*L19","v":40.663761237455354},null,null,{"$f":"+W112-V19*Q38/2","v":33.951569876496286},null,null,null,null,null,null,{"$f":"+W113-AA38/2*V19","v":33.048430123503714},null,null,{"$f":"+AG112-AF19*AA38/2","v":24.652350592709915},null,null,null,null,null,null,{"$f":"+AG113-AK38/2*AF19","v":17.347649407290085},null,null,{"$f":"+AQ112-AP19*AK38/2","v":18.679355523353145},null,null,null,null,null,null,{"$f":"+AQ113-AU38/2*AP19","v":33.320644476646855},null,null,{"$f":"+BA112-AZ19*AU38/2","v":45.288707642097236},null,null,null,null,null,null,{"$f":"+BA113-BE38/2*AZ19","v":41.711292357902764}]
[]
[]
[null,"kiriş kolon yüzü moment (KNm)",null,null,null,null,null,{"$f":"+M105-(M112+H152)/2*G38/2","v":14.744074950928381},null,null,null,null,null,null,{"$f":"+M106-(O152+M113)/2*Q38/2","v":27.399119900749781},null,null,{"$f":"+W105-(W112+R152)/2*Q38/2","v":31.166776281633759},null,null,null,null,null,null,{"$f":"+W106-(Y152+W113)/2*AA38/2","v":25.683141960904159},null,null,{"$f":"+AG105-(AG112+AB152)/2*AA38/2","v":18.429320766564281},null,null,null,null,null,null,{"$f":"+AG106-(AI152+AG113)/2*AK38/2","v":7.4722689884345321},null,null,{"$f":"+AQ105-(AQ112+AL152)/2*AK38/2","v":8.8069185335881279},null,null,null,null,null,null,{"$f":"+AQ106-(AS152+AQ113)/2*AU38/2","v":26.08949644017553},null,null,{"$f":"+BA105-(BA112+AV152)/2*AU38/2","v":33.740552671767844},null,null,null,null,null,null,{"$f":"+BA106-(BC152+BA113)/2*BE38/2","v":24.79701446128168}]